{"text_format":"1","workbook":"xlsx","n_sheets":7,"sheets":["Introduction","Water","Sanitation","Hygiene","MICS05","MICS12","data_summary"],"not_rendered":{"charts":111,"images":76,"macros":1,"external_links":0,"defined_names":0,"comments":0,"pivot_tables":0},"unopened":[],"bounds":{"document_bytes":16777216,"sheet_cells":100000,"rows_first":2000,"rows_last":500,"rows_between":2000,"halvings":0,"cell_chars":16384,"cell_head_chars":4096},"cells_cut":0,"cells_raw":0,"read":"whole","date_system":"1900"}

{"sheet":"Introduction","index":0,"n_rows":55,"n_cols":12,"rows_kept":55,"cut":false,"hidden":false,"merged":[[107,0,107,1],[1,0,1,1],[4,0,4,1],[5,0,5,1],[6,0,6,1],[7,0,7,1],[112,0,112,1],[113,0,113,1],[207,0,207,1],[212,0,212,1],[213,0,213,1]]}
[]
[]
[]
[null,null,"Joint Monitoring Programme for Water Supply, Sanitation and Hygiene"]
[]
[null,null,"Estimates on household water, sanitation and hygiene \nby wealth quintile and sub-national region in"]
[null,null,{"$f":"+Water!B5","v":"Belarus"}]
[]
[null,null,"Updated May 2021"]
[]
[null,null,"Follow the links below to find the following information: "]
[]
[null,null,"JMP Estimates"]
[null,null,"WASH status and trends by wealth quintile \n(customized quintiles made without water and sanitation assets)"]
[null,null,"Water"]
[null,null,"Sanitation"]
[null,null,"Hygiene"]
[]
[null,null,"Data inputs"]
[null,null," customized wealth quintiles and subnational data:"]
[null,null,{"$f":"IF(INDIRECT(CONCATENATE(\"Water\",\"!B105\"))=0,\"\",INDIRECT(CONCATENATE(\"Water\",\"!B105\")))","v":"MICS05"}]
[null,null,{"$f":"IF(INDIRECT(CONCATENATE(\"Water\",\"!B106\"))=0,\"\",INDIRECT(CONCATENATE(\"Water\",\"!B106\")))","v":"MICS12"}]
[null,null,{"$f":"IF(INDIRECT(CONCATENATE(\"Water\",\"!B107\"))=0,\"\",INDIRECT(CONCATENATE(\"Water\",\"!B107\")))","v":""}]
[null,null,{"$f":"IF(INDIRECT(CONCATENATE(\"Water\",\"!B108\"))=0,\"\",INDIRECT(CONCATENATE(\"Water\",\"!B108\")))","v":""}]
[null,null,{"$f":"IF(INDIRECT(CONCATENATE(\"Water\",\"!B109\"))=0,\"\",INDIRECT(CONCATENATE(\"Water\",\"!B109\")))","v":""}]
[null,null,{"$f":"IF(INDIRECT(CONCATENATE(\"Water\",\"!B110\"))=0,\"\",INDIRECT(CONCATENATE(\"Water\",\"!B110\")))","v":""}]
[null,null,{"$f":"IF(INDIRECT(CONCATENATE(\"Water\",\"!B111\"))=0,\"\",INDIRECT(CONCATENATE(\"Water\",\"!B111\")))","v":""}]
[null,null,{"$f":"IF(INDIRECT(CONCATENATE(\"Water\",\"!B112\"))=0,\"\",INDIRECT(CONCATENATE(\"Water\",\"!B112\")))","v":""}]
[null,null,{"$f":"IF(INDIRECT(CONCATENATE(\"Water\",\"!B113\"))=0,\"\",INDIRECT(CONCATENATE(\"Water\",\"!B113\")))","v":""}]
[null,null,{"$f":"IF(INDIRECT(CONCATENATE(\"Water\",\"!B114\"))=0,\"\",INDIRECT(CONCATENATE(\"Water\",\"!B114\")))","v":""}]
[null,null,{"$f":"IF(INDIRECT(CONCATENATE(\"Water\",\"!B115\"))=0,\"\",INDIRECT(CONCATENATE(\"Water\",\"!B115\")))","v":""}]
[null,null,{"$f":"IF(INDIRECT(CONCATENATE(\"Water\",\"!B116\"))=0,\"\",INDIRECT(CONCATENATE(\"Water\",\"!B116\")))","v":""}]
[]
[]
[]
[]
[]
[]
[]
[]
[]
[]
[]
[]
[]
[]
[]
[]
[]
[]
[]
[]
[]
[]
[null,null,null,null,null,null,null,null,null,null,null,{"$f":"+IF(ISNUMBER(M48), \"\", \"Insufficient data to estimate safely managed sanitation services at national level\")","v":"Insufficient data to estimate safely managed sanitation services at national level"}]

{"sheet":"Water","index":1,"n_rows":318,"n_cols":28,"rows_kept":318,"cut":false,"hidden":false,"merged":[[3,1,3,24],[317,18,317,22],[117,18,117,22],[196,18,196,22],[296,23,296,27],[298,0,299,1],[300,0,301,1],[296,0,297,2],[296,3,296,7],[296,8,296,12],[296,13,296,17],[296,18,296,22],[196,23,196,27],[198,0,199,1],[200,0,201,1],[196,13,196,17],[96,8,96,12],[96,13,96,17],[96,18,96,22],[217,18,217,22],[98,0,99,1],[100,0,101,1],[196,0,197,2],[196,3,196,7],[196,8,196,12],[217,1,217,11],[35,3,36,3],[38,1,39,2],[38,3,39,3],[96,0,97,2],[96,3,96,7],[317,1,317,11],[6,9,6,16],[6,17,6,24],[6,1,6,8],[4,1,4,24],[117,1,117,11],[30,21,30,24],[32,1,33,2],[32,3,33,3],[30,17,30,20],[30,1,31,4],[30,5,30,8],[30,9,30,12],[30,13,30,16],[96,23,96,27],[35,1,36,2]]}
["BGD"]
[]
[]
[null,"Summary of trends in use of drinking water by wealth quintile (%)"]
[null,{"$f":"IF(ISERROR(INDIRECT(CONCATENATE($B105,\"!A2\"))),\"\",INDIRECT(CONCATENATE($B105,\"!A2\")))","v":"Belarus"}]
[]
[null,{"$f":"B118","v":"National use of drinking water sources, 2000–2018"},null,null,null,null,null,null,null,{"$f":"B218","v":"Urban use of drinking water sources,  2000–2018"},null,null,null,null,null,null,null,{"$f":"B318","v":"Rural use of drinking water sources, 2018–2020"}]
[]
[]
[]
[]
[]
[]
[]
[]
[]
[]
[]
[]
[]
[]
[]
[]
[]
[]
[]
[]
[]
[]
[]
[null,{"$f":"IF(ISERROR(INDIRECT(CONCATENATE($B105,\"!A2\"))),\"\",INDIRECT(CONCATENATE($B105,\"!A2\")))","v":"Belarus"},null,null,null,"Poorest",null,null,null,"Poor",null,null,null,"Middle",null,null,null,"Rich",null,null,null,"Richest"]
[null,null,null,null,null,"Basic","Limited","Unimproved","Surface \n water","Basic","Limited","Unimproved","Surface \nwater","Basic","Limited","Unimproved","Surface \nwater","Basic","Limited","Unimproved","Surface \nwater","Basic","Limited","Unimproved","Surface \nwater"]
[null,"NATIONAL",null,"Estimate",{"$f":"C99","v":2000},{"$f":"E99","v":98.438179768131178},{"$f":"F99","v":0.2026570156974879},1.3591632161713392,0,{"$f":"J99","v":99.387426777566631},{"$f":"K99","v":3.7819371641516095E-2},0.5747538507918506,0,{"$f":"O99","v":100},{"$f":"P99","v":0},0,0,{"$f":"T99","v":99.962686404303852},{"$f":"U99","v":3.7313595696133461E-2},0,0,{"$f":"Y99","v":99.972003625559168},{"$f":"Z99","v":2.1387003148660572E-2},6.6093712921713177E-3,0]
[null,null,null,null,{"$f":"C100","v":2018},{"$f":"E100","v":98.804426840618405},0.20341101723320329,0.99216214214838772,0,{"$f":"J100","v":99.573438889854401},3.789015384639377E-2,0.38867095629920811,0,{"$f":"O100","v":99.772831945569664},0,0.2271680544303365,0,{"$f":"T100","v":99.788558552333527},3.7248598080507379E-2,0.17419284958596393,0,{"$f":"Y100","v":99.853382009514462},2.1361626435342417E-2,0.1252563640502018,0]
[]
[null,"URBAN",null,"Estimate",{"$f":"C199","v":2000},{"$f":"E199","v":98.740584621527233},{"$f":"F199","v":0.14102545198677213},1.1183899264859889,0,{"$f":"J199","v":99.987175832535499},{"$f":"K199","v":1.2824167464501102E-2},0,0,{"$f":"O199","v":99.945103277426938},{"$f":"P199","v":5.4896722573062107E-2},0,0,{"$f":"T199","v":100},{"$f":"U199","v":0},0,0,{"$f":"Y199","v":99.953703519353098},{"$f":"Z199","v":3.2382830892838194E-2},1.3913649754059065E-2,0]
[null,null,null,null,{"$f":"C200","v":2018},{"$f":"E200","v":99.856626912650952},0.14261943048249764,7.5365686655004538E-4,0,{"$f":"J200","v":99.602955668266318},1.2774888107535578E-2,0.38426944362615245,0,{"$f":"O200","v":99.945103277426938},5.4896722573062107E-2,0,0,{"$f":"T200","v":99.759697778601947},0,0.24030222139805346,0,{"$f":"Y200","v":99.795750233987619},3.2331657456048352E-2,0.17191810855632639,0]
[]
[null,"RURAL",null,"Estimate",{"$f":"C299","v":2018},{"$f":"E299","v":97.915113355381393},{"$f":"F299","v":0.13569383510894018},1.9491928095096682,0,{"$f":"J299","v":98.343013756251764},{"$f":"K299","v":0.35659248413125},1.3003937596169806,0,{"$f":"O299","v":98.895948339779082},{"$f":"P299","v":0},1.1040516602209181,0,{"$f":"T299","v":99.932943770666967},{"$f":"U299","v":0},6.7056229333033457E-2,0,{"$f":"Y299","v":99.422081815898267},{"$f":"Z299","v":0},0.57791818410173335,0]
[null,null,null,null,{"$f":"C300","v":2020},{"$f":"E300","v":97.915113355381393},0.13569383510894018,1.9491928095096682,0,{"$f":"J300","v":98.343013756251764},0.35659248413125,1.3003937596169806,0,{"$f":"O300","v":98.895948339779082},0,1.1040516602209181,0,{"$f":"T300","v":99.932943770666967},0,6.7056229333033457E-2,0,{"$f":"Y300","v":99.422081815898267},0,0.57791818410173335,0]
[]
[]
[]
[]
[]
[]
[]
[]
[]
[]
[]
[]
[]
[]
[]
[]
[]
[]
[]
[]
[]
[]
[]
[]
[]
[]
[]
[]
[]
[]
[]
[]
[]
[]
[]
[]
[]
[]
[]
[]
[]
[]
[]
[]
[]
[]
[]
[]
[]
[]
[]
[]
[]
[]
[]
[]
["NATIONAL",null,null,"Poorest",null,null,null,null,"Poor",null,null,null,null,"Middle",null,null,null,null,"Rich",null,null,null,null,"Richest"]
[null,null,null,"Improved","Basic","Limited","Unimproved","Surface water","Improved","Basic","Limited","Unimproved","Surface water","Improved","Basic","Limited","Unimproved","Surface water","Improved","Basic","Limited","Unimproved","Surface water","Improved","Basic","Limited","Unimproved","Surface water"]
["Forecast period:",null,{"$f":"MinBase(C105:C116)","v":2000},{"$f":"IF((D101+H101)>100,D101*100/(D101+H101),D101)","v":98.640836783828661},{"$f":"D99*AVERAGEIF(E105:E116,\">0\")/100","v":98.438179768131178},{"$f":"D99*(100-AVERAGEIF(E105:E116,\">0\"))/100","v":0.2026570156974879},{"$f":"100-(E99+F99+H99)","v":1.3591632161713392},{"$f":"IF((D101+H101)>100,H101*100/(D101+H101),H101)","v":0},{"$f":"IF((I101+M101)>100,I101*100/(I101+M101),I101)","v":99.425246149208149},{"$f":"I99*AVERAGEIF(J105:J116,\">0\")/100","v":99.387426777566631},{"$f":"I99*(100-AVERAGEIF(J105:J116,\">0\"))/100","v":3.7819371641516095E-2},{"$f":"100-(J99+K99+M99)","v":0.5747538507918506},{"$f":"IF((I101+M101)>100,M101*100/(I101+M101),M101)","v":0},{"$f":"IF((N101+R101)>100,N101*100/(N101+R101),N101)","v":100},{"$f":"N99*AVERAGEIF(O105:O116,\">0\")/100","v":100},{"$f":"N99*(100-AVERAGEIF(O105:O116,\">0\"))/100","v":0},{"$f":"100-(O99+P99+R99)","v":0},{"$f":"IF((N101+R101)>100,R101*100/(N101+R101),R101)","v":0},{"$f":"IF((S101+W101)>100,S101*100/(S101+W101),S101)","v":100},{"$f":"S99*AVERAGEIF(T105:T116,\">0\")/100","v":99.962686404303852},{"$f":"S99*(100-AVERAGEIF(T105:T116,\">0\"))/100","v":3.7313595696133461E-2},{"$f":"100-(T99+U99+W99)","v":0},{"$f":"IF((S101+W101)>100,W101*100/(S101+W101),W101)","v":0},{"$f":"IF((X101+AB101)>100,X101*100/(X101+AB101),X101)","v":99.993390628707829},{"$f":"X99*AVERAGEIF(Y105:Y116,\">0\")/100","v":99.972003625559168},{"$f":"X99*(100-AVERAGEIF(Y105:Y116,\">0\"))/100","v":2.1387003148660572E-2},{"$f":"100-(Y99+Z99+AB99)","v":6.6093712921713177E-3},{"$f":"IF((X101+AB101)>100,AB101*100/(X101+AB101),AB101)","v":0}]
[null,null,{"$f":"MaxTarget(C105:C116)","v":2018},{"$f":"IF((D102+H102)>100,D102*100/(D102+H102),D102)","v":99.007837857851598},{"$f":"D100*AVERAGEIF(E105:E116,\">0\")/100","v":98.804426840618405},{"$f":"D100*(100-AVERAGEIF(E105:E116,\">0\"))/100","v":0.20341101723320329},{"$f":"100-(E100+F100+H100)","v":0.99216214214838772},{"$f":"IF((D102+H102)>100,H102*100/(D102+H102),H102)","v":0},{"$f":"IF((I102+M102)>100,I102*100/(I102+M102),I102)","v":99.611329043700792},{"$f":"I100*AVERAGEIF(J105:J116,\">0\")/100","v":99.573438889854401},{"$f":"I100*(100-AVERAGEIF(J105:J116,\">0\"))/100","v":3.789015384639377E-2},{"$f":"100-(J100+K100+M100)","v":0.38867095629920811},{"$f":"IF((I102+M102)>100,M102*100/(I102+M102),M102)","v":0},{"$f":"IF((N102+R102)>100,N102*100/(N102+R102),N102)","v":99.772831945569678},{"$f":"N100*AVERAGEIF(O105:O116,\">0\")/100","v":99.772831945569664},{"$f":"N100*(100-AVERAGEIF(O105:O116,\">0\"))/100","v":0},{"$f":"100-(O100+P100+R100)","v":0.2271680544303365},{"$f":"IF((N102+R102)>100,R102*100/(N102+R102),R102)","v":0},{"$f":"IF((S102+W102)>100,S102*100/(S102+W102),S102)","v":99.825807150414036},{"$f":"S100*AVERAGEIF(T105:T116,\">0\")/100","v":99.788558552333527},{"$f":"S100*(100-AVERAGEIF(T105:T116,\">0\"))/100","v":3.7248598080507379E-2},{"$f":"100-(T100+U100+W100)","v":0.17419284958596393},{"$f":"IF((S102+W102)>100,W102*100/(S102+W102),W102)","v":0},{"$f":"IF((X102+AB102)>100,X102*100/(X102+AB102),X102)","v":99.874743635949798},{"$f":"X100*AVERAGEIF(Y105:Y116,\">0\")/100","v":99.853382009514462},{"$f":"X100*(100-AVERAGEIF(Y105:Y116,\">0\"))/100","v":2.1361626435342417E-2},{"$f":"100-(Y100+Z100+AB100)","v":0.1252563640502018},{"$f":"IF((X102+AB102)>100,AB102*100/(X102+AB102),AB102)","v":0}]
["Regression period:",null,{"$f":"MinRegYear(C99,C105:C116)","v":2003},{"$f":"IF(MAX(C105:C116)-MIN(C105:C116)<5,AVERAGEIF(C105:C116,\">0\",D105:D116),\nIF(FORECAST($C101,D$105:D$116,$C$105:$C$116)<0,0,\nIF(FORECAST($C101,D$105:D$116,$C$105:$C$116)>100,100,\nFORECAST($C101,D$105:D$116,$C$105:$C$116))))","v":98.640836783828661},null,null,null,{"$f":"IF(MAX(C105:C116)-MIN(C105:C116)<5,AVERAGEIF(C105:C116,\">0\",H105:H116),\nIF(FORECAST($C101,H$105:H$116,$C$105:$C$116)<0,0,\nIF(FORECAST($C101,H$105:H$116,$C$105:$C$116)>100,100,\nFORECAST($C101,H$105:H$116,$C$105:$C$116))))","v":0},{"$f":"IF(MAX(C105:C116)-MIN(C105:C116)<5,AVERAGEIF(C105:C116,\">0\",I105:I116),\nIF(FORECAST($C101,I$105:I$116,$C$105:$C$116)<0,0,\nIF(FORECAST($C101,I$105:I$116,$C$105:$C$116)>100,100,\nFORECAST($C101,I$105:I$116,$C$105:$C$116))))","v":99.425246149208149},null,null,null,{"$f":"IF(MAX(C105:C116)-MIN(C105:C116)<5,AVERAGEIF(C105:C116,\">0\",M105:M116),\nIF(FORECAST($C101,M$105:M$116,$C$105:$C$116)<0,0,\nIF(FORECAST($C101,M$105:M$116,$C$105:$C$116)>100,100,\nFORECAST($C101,M$105:M$116,$C$105:$C$116))))","v":0},{"$f":"IF(MAX(C105:C116)-MIN(C105:C116)<5,AVERAGEIF(C105:C116,\">0\",N105:N116),\nIF(FORECAST($C101,N$105:N$116,$C$105:$C$116)<0,0,\nIF(FORECAST($C101,N$105:N$116,$C$105:$C$116)>100,100,\nFORECAST($C101,N$105:N$116,$C$105:$C$116))))","v":100},null,null,null,{"$f":"IF(MAX(C105:C116)-MIN(C105:C116)<5,AVERAGEIF(C105:C116,\">0\",R105:R116),\nIF(FORECAST($C101,R$105:R$116,$C$105:$C$116)<0,0,\nIF(FORECAST($C101,R$105:R$116,$C$105:$C$116)>100,100,\nFORECAST($C101,R$105:R$116,$C$105:$C$116))))","v":0},{"$f":"IF(MAX(C105:C116)-MIN(C105:C116)<5,AVERAGEIF(C105:C116,\">0\",S105:S116),\nIF(FORECAST($C101,S$105:S$116,$C$105:$C$116)<0,0,\nIF(FORECAST($C101,S$105:S$116,$C$105:$C$116)>100,100,\nFORECAST($C101,S$105:S$116,$C$105:$C$116))))","v":100},null,null,null,{"$f":"IF(MAX(C105:C116)-MIN(C105:C116)<5,AVERAGEIF(C105:C116,\">0\",W105:W116),\nIF(FORECAST($C101,W$105:W$116,$C$105:$C$116)<0,0,\nIF(FORECAST($C101,W$105:W$116,$C$105:$C$116)>100,100,\nFORECAST($C101,W$105:W$116,$C$105:$C$116))))","v":0},{"$f":"IF(MAX(C105:C116)-MIN(C105:C116)<5,AVERAGEIF(C105:C116,\">0\",X105:X116),\nIF(FORECAST($C101,X$105:X$116,$C$105:$C$116)<0,0,\nIF(FORECAST($C101,X$105:X$116,$C$105:$C$116)>100,100,\nFORECAST($C101,X$105:X$116,$C$105:$C$116))))","v":99.993390628707829},null,null,null,{"$f":"IF(MAX(C105:C116)-MIN(C105:C116)<5,AVERAGEIF(C105:C116,\">0\",AB105:AB116),\nIF(FORECAST($C101,AB$105:AB$116,$C$105:$C$116)<0,0,\nIF(FORECAST($C101,AB$105:AB$116,$C$105:$C$116)>100,100,\nFORECAST($C101,AB$105:AB$116,$C$105:$C$116))))","v":0}]
[null,null,{"$f":"MaxRegYear(C100,C105:C116)","v":2014},{"$f":"IF(MAX(C105:C116)-MIN(C105:C116)<5,AVERAGEIF(C105:C116,\">0\",D105:D116),\nIF(FORECAST($C102,D$105:D$116,$C$105:$C$116)<0,0,\nIF(FORECAST($C102,D$105:D$116,$C$105:$C$116)>100,100,\nFORECAST($C102,D$105:D$116,$C$105:$C$116))))","v":99.007837857851598},null,null,null,{"$f":"IF(MAX(C105:C116)-MIN(C105:C116)<5,AVERAGEIF(C105:C116,\">0\",H105:H116),\nIF(FORECAST($C102,H$105:H$116,$C$105:$C$116)<0,0,\nIF(FORECAST($C102,H$105:H$116,$C$105:$C$116)>100,100,\nFORECAST($C102,H$105:H$116,$C$105:$C$116))))","v":0},{"$f":"IF(MAX(C105:C116)-MIN(C105:C116)<5,AVERAGEIF(C105:C116,\">0\",I105:I116),\nIF(FORECAST($C102,I$105:I$116,$C$105:$C$116)<0,0,\nIF(FORECAST($C102,I$105:I$116,$C$105:$C$116)>100,100,\nFORECAST($C102,I$105:I$116,$C$105:$C$116))))","v":99.611329043700792},null,null,null,{"$f":"IF(MAX(C105:C116)-MIN(C105:C116)<5,AVERAGEIF(C105:C116,\">0\",M105:M116),\nIF(FORECAST($C102,M$105:M$116,$C$105:$C$116)<0,0,\nIF(FORECAST($C102,M$105:M$116,$C$105:$C$116)>100,100,\nFORECAST($C102,M$105:M$116,$C$105:$C$116))))","v":0},{"$f":"IF(MAX(C105:C116)-MIN(C105:C116)<5,AVERAGEIF(C105:C116,\">0\",N105:N116),\nIF(FORECAST($C102,N$105:N$116,$C$105:$C$116)<0,0,\nIF(FORECAST($C102,N$105:N$116,$C$105:$C$116)>100,100,\nFORECAST($C102,N$105:N$116,$C$105:$C$116))))","v":99.772831945569678},null,null,null,{"$f":"IF(MAX(C105:C116)-MIN(C105:C116)<5,AVERAGEIF(C105:C116,\">0\",R105:R116),\nIF(FORECAST($C102,R$105:R$116,$C$105:$C$116)<0,0,\nIF(FORECAST($C102,R$105:R$116,$C$105:$C$116)>100,100,\nFORECAST($C102,R$105:R$116,$C$105:$C$116))))","v":0},{"$f":"IF(MAX(C105:C116)-MIN(C105:C116)<5,AVERAGEIF(C105:C116,\">0\",S105:S116),\nIF(FORECAST($C102,S$105:S$116,$C$105:$C$116)<0,0,\nIF(FORECAST($C102,S$105:S$116,$C$105:$C$116)>100,100,\nFORECAST($C102,S$105:S$116,$C$105:$C$116))))","v":99.825807150414036},null,null,null,{"$f":"IF(MAX(C105:C116)-MIN(C105:C116)<5,AVERAGEIF(C105:C116,\">0\",W105:W116),\nIF(FORECAST($C102,W$105:W$116,$C$105:$C$116)<0,0,\nIF(FORECAST($C102,W$105:W$116,$C$105:$C$116)>100,100,\nFORECAST($C102,W$105:W$116,$C$105:$C$116))))","v":0},{"$f":"IF(MAX(C105:C116)-MIN(C105:C116)<5,AVERAGEIF(C105:C116,\">0\",X105:X116),\nIF(FORECAST($C102,X$105:X$116,$C$105:$C$116)<0,0,\nIF(FORECAST($C102,X$105:X$116,$C$105:$C$116)>100,100,\nFORECAST($C102,X$105:X$116,$C$105:$C$116))))","v":99.874743635949798},null,null,null,{"$f":"IF(MAX(C105:C116)-MIN(C105:C116)<5,AVERAGEIF(C105:C116,\">0\",AB105:AB116),\nIF(FORECAST($C102,AB$105:AB$116,$C$105:$C$116)<0,0,\nIF(FORECAST($C102,AB$105:AB$116,$C$105:$C$116)>100,100,\nFORECAST($C102,AB$105:AB$116,$C$105:$C$116))))","v":0}]
[]
[null,"Survey","Year","Improved","% Improved\n< = 30min",null,null,"Surface water","Improved","% Improved\n< = 30min",null,null,"Surface water","Improved","% Improved\n< = 30min",null,null,"Surface water","Improved","% Improved\n< = 30min",null,null,"Surface water","Improved","% Improved\n< = 30min",null,null,"Surface water"]
[null,"MICS05",2005,{"$f":"IF(ISERROR(INDIRECT(CONCATENATE($B105,\"!C16\"))),\"\",INDIRECT(CONCATENATE($B105,\"!C16\")))","v":98.707564251832835},{"$f":"IF(ISERROR(INDIRECT(CONCATENATE($B105,\"!C23\"))),\"\",INDIRECT(CONCATENATE($B105,\"!C23\")))","v":99.863440686559429},null,null,{"$f":"IF(ISERROR(INDIRECT(CONCATENATE($B105,\"!C21\"))),\"\",INDIRECT(CONCATENATE($B105,\"!C21\")))","v":0},{"$f":"IF(ISERROR(INDIRECT(CONCATENATE($B105,\"!D16\"))),\"\",INDIRECT(CONCATENATE($B105,\"!D16\")))","v":99.459079402752266},{"$f":"IF(ISERROR(INDIRECT(CONCATENATE($B105,\"!D23\"))),\"\",INDIRECT(CONCATENATE($B105,\"!D23\")))","v":100},null,null,{"$f":"IF(ISERROR(INDIRECT(CONCATENATE($B105,\"!D21\"))),\"\",INDIRECT(CONCATENATE($B105,\"!D21\")))","v":0},{"$f":"IF(ISERROR(INDIRECT(CONCATENATE($B105,\"!E16\"))),\"\",INDIRECT(CONCATENATE($B105,\"!E16\")))","v":99.962174886417841},{"$f":"IF(ISERROR(INDIRECT(CONCATENATE($B105,\"!E23\"))),\"\",INDIRECT(CONCATENATE($B105,\"!E23\")))","v":100},null,null,{"$f":"IF(ISERROR(INDIRECT(CONCATENATE($B105,\"!E21\"))),\"\",INDIRECT(CONCATENATE($B105,\"!E21\")))","v":0},{"$f":"IF(ISERROR(INDIRECT(CONCATENATE($B105,\"!F16\"))),\"\",INDIRECT(CONCATENATE($B105,\"!F16\")))","v":100},{"$f":"IF(ISERROR(INDIRECT(CONCATENATE($B105,\"!F23\"))),\"\",INDIRECT(CONCATENATE($B105,\"!F23\")))","v":99.950265219397522},null,null,{"$f":"IF(ISERROR(INDIRECT(CONCATENATE($B105,\"!F21\"))),\"\",INDIRECT(CONCATENATE($B105,\"!F21\")))","v":0},{"$f":"IF(ISERROR(INDIRECT(CONCATENATE($B105,\"!G16\"))),\"\",INDIRECT(CONCATENATE($B105,\"!G16\")))","v":99.971818448206363},{"$f":"IF(ISERROR(INDIRECT(CONCATENATE($B105,\"!G23\"))),\"\",INDIRECT(CONCATENATE($B105,\"!G23\")))","v":99.957223166422921},null,null,{"$f":"IF(ISERROR(INDIRECT(CONCATENATE($B105,\"!G221\"))),\"\",INDIRECT(CONCATENATE($B105,\"!G21\")))","v":0}]
[null,"MICS12",2012,98.941110389847438,99.725660496469658,null,null,0,99.577495790156675,99.92392400701776,null,null,0,99.814908154647057,100,null,null,0,99.864516672544241,99.975107589210197,null,null,0,99.896315816451249,100,null,null,0]
[null,null,null,"","",null,null,"","","",null,null,"","","",null,null,"","","",null,null,"","","",null,null,""]
[null,null,null,"","",null,null,"","","",null,null,"","","",null,null,"","","",null,null,"","","",null,null,""]
[null,null,null,"","",null,null,"","","",null,null,"","","",null,null,"","","",null,null,"","","",null,null,""]
[null,null,null,"","",null,null,"","","",null,null,"","","",null,null,"","","",null,null,"","","",null,null,""]
[null,null,null,{"$f":"IF(ISERROR(INDIRECT(CONCATENATE($B111,\"!C16\"))),\"\",INDIRECT(CONCATENATE($B111,\"!C16\")))","v":""},{"$f":"IF(ISERROR(INDIRECT(CONCATENATE($B111,\"!C23\"))),\"\",INDIRECT(CONCATENATE($B111,\"!C23\")))","v":""},null,null,{"$f":"IF(ISERROR(INDIRECT(CONCATENATE($B111,\"!C21\"))),\"\",INDIRECT(CONCATENATE($B111,\"!C21\")))","v":""},{"$f":"IF(ISERROR(INDIRECT(CONCATENATE($B111,\"!D16\"))),\"\",INDIRECT(CONCATENATE($B111,\"!D16\")))","v":""},{"$f":"IF(ISERROR(INDIRECT(CONCATENATE($B111,\"!D23\"))),\"\",INDIRECT(CONCATENATE($B111,\"!D23\")))","v":""},null,null,{"$f":"IF(ISERROR(INDIRECT(CONCATENATE($B111,\"!D21\"))),\"\",INDIRECT(CONCATENATE($B111,\"!D21\")))","v":""},{"$f":"IF(ISERROR(INDIRECT(CONCATENATE($B111,\"!E16\"))),\"\",INDIRECT(CONCATENATE($B111,\"!E16\")))","v":""},{"$f":"IF(ISERROR(INDIRECT(CONCATENATE($B111,\"!E23\"))),\"\",INDIRECT(CONCATENATE($B111,\"!E23\")))","v":""},null,null,{"$f":"IF(ISERROR(INDIRECT(CONCATENATE($B111,\"!E21\"))),\"\",INDIRECT(CONCATENATE($B111,\"!E21\")))","v":""},{"$f":"IF(ISERROR(INDIRECT(CONCATENATE($B111,\"!F16\"))),\"\",INDIRECT(CONCATENATE($B111,\"!F16\")))","v":""},{"$f":"IF(ISERROR(INDIRECT(CONCATENATE($B111,\"!F23\"))),\"\",INDIRECT(CONCATENATE($B111,\"!F23\")))","v":""},null,null,{"$f":"IF(ISERROR(INDIRECT(CONCATENATE($B111,\"!F21\"))),\"\",INDIRECT(CONCATENATE($B111,\"!F21\")))","v":""},{"$f":"IF(ISERROR(INDIRECT(CONCATENATE($B111,\"!G16\"))),\"\",INDIRECT(CONCATENATE($B111,\"!G16\")))","v":""},{"$f":"IF(ISERROR(INDIRECT(CONCATENATE($B111,\"!G23\"))),\"\",INDIRECT(CONCATENATE($B111,\"!G23\")))","v":""},null,null,{"$f":"IF(ISERROR(INDIRECT(CONCATENATE($B111,\"!G221\"))),\"\",INDIRECT(CONCATENATE($B111,\"!G21\")))","v":""}]
[null,null,null,{"$f":"IF(ISERROR(INDIRECT(CONCATENATE($B112,\"!C16\"))),\"\",INDIRECT(CONCATENATE($B112,\"!C16\")))","v":""},{"$f":"IF(ISERROR(INDIRECT(CONCATENATE($B112,\"!C23\"))),\"\",INDIRECT(CONCATENATE($B112,\"!C23\")))","v":""},null,null,{"$f":"IF(ISERROR(INDIRECT(CONCATENATE($B112,\"!C21\"))),\"\",INDIRECT(CONCATENATE($B112,\"!C21\")))","v":""},{"$f":"IF(ISERROR(INDIRECT(CONCATENATE($B112,\"!D16\"))),\"\",INDIRECT(CONCATENATE($B112,\"!D16\")))","v":""},{"$f":"IF(ISERROR(INDIRECT(CONCATENATE($B112,\"!D23\"))),\"\",INDIRECT(CONCATENATE($B112,\"!D23\")))","v":""},null,null,{"$f":"IF(ISERROR(INDIRECT(CONCATENATE($B112,\"!D21\"))),\"\",INDIRECT(CONCATENATE($B112,\"!D21\")))","v":""},{"$f":"IF(ISERROR(INDIRECT(CONCATENATE($B112,\"!E16\"))),\"\",INDIRECT(CONCATENATE($B112,\"!E16\")))","v":""},{"$f":"IF(ISERROR(INDIRECT(CONCATENATE($B112,\"!E23\"))),\"\",INDIRECT(CONCATENATE($B112,\"!E23\")))","v":""},null,null,{"$f":"IF(ISERROR(INDIRECT(CONCATENATE($B112,\"!E21\"))),\"\",INDIRECT(CONCATENATE($B112,\"!E21\")))","v":""},{"$f":"IF(ISERROR(INDIRECT(CONCATENATE($B112,\"!F16\"))),\"\",INDIRECT(CONCATENATE($B112,\"!F16\")))","v":""},{"$f":"IF(ISERROR(INDIRECT(CONCATENATE($B112,\"!F23\"))),\"\",INDIRECT(CONCATENATE($B112,\"!F23\")))","v":""},null,null,{"$f":"IF(ISERROR(INDIRECT(CONCATENATE($B112,\"!F21\"))),\"\",INDIRECT(CONCATENATE($B112,\"!F21\")))","v":""},{"$f":"IF(ISERROR(INDIRECT(CONCATENATE($B112,\"!G16\"))),\"\",INDIRECT(CONCATENATE($B112,\"!G16\")))","v":""},{"$f":"IF(ISERROR(INDIRECT(CONCATENATE($B112,\"!G23\"))),\"\",INDIRECT(CONCATENATE($B112,\"!G23\")))","v":""},null,null,{"$f":"IF(ISERROR(INDIRECT(CONCATENATE($B112,\"!G221\"))),\"\",INDIRECT(CONCATENATE($B112,\"!G21\")))","v":""}]
[null,null,null,"","",null,null,"","","",null,null,"","","",null,null,"","","",null,null,"","","",null,null,""]
[null,null,null,"","",null,null,"","","",null,null,"","","",null,null,"","","",null,null,"","","",null,null,""]
[null,null,null,"","",null,null,"","","",null,null,"","","",null,null,"","","",null,null,"","","",null,null,""]
[null,null,null,"","",null,null,"","","",null,null,"","","",null,null,"","","",null,null,"","","",null,null,""]
[]
[null,{"$f":"CONCATENATE(\"National use of drinking water sources, \",C99,\"–\",C100)","v":"National use of drinking water sources, 2000–2018"},null,null,null,null,null,null,null,null,null,null,null,null,null,null,null,null,"Data points used for regression"]
[]
[]
[]
[]
[]
[]
[]
[]
[]
[]
[]
[]
[]
[]
[]
[]
[]
[]
[]
[]
[]
[]
[]
[]
[]
[]
[]
[]
[]
[]
[]
[]
[]
[]
[null,null,null,null,{"$f":"IF(ISERROR(INDIRECT(CONCATENATE($B153,\"!M18\"))),\"\",INDIRECT(CONCATENATE($B153,\"!M18\")))","v":""},{"$f":"IF(ISERROR(INDIRECT(CONCATENATE($B153,\"!M19\"))),\"\",INDIRECT(CONCATENATE($B153,\"!M19\")))","v":""},{"$f":"IF(ISERROR(INDIRECT(CONCATENATE($B153,\"!M20\"))),\"\",INDIRECT(CONCATENATE($B153,\"!M20\")))","v":""},{"$f":"IF(ISERROR(INDIRECT(CONCATENATE($B153,\"!M21\"))),\"\",INDIRECT(CONCATENATE($B153,\"!M21\")))","v":""},null,{"$f":"IF(ISERROR(INDIRECT(CONCATENATE($B153,\"!N18\"))),\"\",INDIRECT(CONCATENATE($B153,\"!N18\")))","v":""},{"$f":"IF(ISERROR(INDIRECT(CONCATENATE($B153,\"!N19\"))),\"\",INDIRECT(CONCATENATE($B153,\"!N19\")))","v":""},{"$f":"IF(ISERROR(INDIRECT(CONCATENATE($B153,\"!N20\"))),\"\",INDIRECT(CONCATENATE($B153,\"!N20\")))","v":""},{"$f":"IF(ISERROR(INDIRECT(CONCATENATE($B153,\"!N21\"))),\"\",INDIRECT(CONCATENATE($B153,\"!N21\")))","v":""},null,{"$f":"IF(ISERROR(INDIRECT(CONCATENATE($B153,\"!O18\"))),\"\",INDIRECT(CONCATENATE($B153,\"!O18\")))","v":""},{"$f":"IF(ISERROR(INDIRECT(CONCATENATE($B153,\"!O19\"))),\"\",INDIRECT(CONCATENATE($B153,\"!O19\")))","v":""},{"$f":"IF(ISERROR(INDIRECT(CONCATENATE($B153,\"!O20\"))),\"\",INDIRECT(CONCATENATE($B153,\"!O20\")))","v":""},{"$f":"IF(ISERROR(INDIRECT(CONCATENATE($B153,\"!O21\"))),\"\",INDIRECT(CONCATENATE($B153,\"!O21\")))","v":""},null,{"$f":"IF(ISERROR(INDIRECT(CONCATENATE($B153,\"!P18\"))),\"\",INDIRECT(CONCATENATE($B153,\"!P18\")))","v":""},{"$f":"IF(ISERROR(INDIRECT(CONCATENATE($B153,\"!P19\"))),\"\",INDIRECT(CONCATENATE($B153,\"!P19\")))","v":""},{"$f":"IF(ISERROR(INDIRECT(CONCATENATE($B153,\"!P20\"))),\"\",INDIRECT(CONCATENATE($B153,\"!P20\")))","v":""},{"$f":"IF(ISERROR(INDIRECT(CONCATENATE($B153,\"!P21\"))),\"\",INDIRECT(CONCATENATE($B153,\"!P21\")))","v":""},null,{"$f":"IF(ISERROR(INDIRECT(CONCATENATE($B153,\"!Q18\"))),\"\",INDIRECT(CONCATENATE($B153,\"!Q18\")))","v":""},{"$f":"IF(ISERROR(INDIRECT(CONCATENATE($B153,\"!Q19\"))),\"\",INDIRECT(CONCATENATE($B153,\"!Q19\")))","v":""},{"$f":"IF(ISERROR(INDIRECT(CONCATENATE($B153,\"!Q20\"))),\"\",INDIRECT(CONCATENATE($B153,\"!Q20\")))","v":""},{"$f":"IF(ISERROR(INDIRECT(CONCATENATE($B153,\"!Q21\"))),\"\",INDIRECT(CONCATENATE($B153,\"!Q1\")))","v":""}]
[null,null,null,null,"","","","",null,"","","","",null,"","","","",null,"","","","",null,"","","",""]
[null,null,null,null,"","","","",null,"","","","",null,"","","","",null,"","","","",null,"","","",""]
[null,null,null,null,"","","","",null,"","","","",null,"","","","",null,"","","","",null,"","","",""]
[null,null,null,null,"","","","",null,"","","","",null,"","","","",null,"","","","",null,"","","",""]
[null,null,null,null,"","","","",null,"","","","",null,"","","","",null,"","","","",null,"","","",""]
[]
[]
[]
[]
[]
[]
[]
[]
[]
[]
[]
[]
[]
[]
[]
[]
[]
[]
[]
[]
[]
[]
[]
[]
[]
[]
[]
[]
[]
[]
[]
[]
[]
[]
[]
[]
[]
[]
["URBAN",null,null,"Poorest",null,null,null,null,"Poor",null,null,null,null,"Middle",null,null,null,null,"Rich",null,null,null,null,"Richest"]
[null,null,null,"Improved","Basic","Limited","Unimproved","Surface water","Improved","Basic","Limited","Unimproved","Surface water","Improved","Basic","Limited","Unimproved","Surface water","Improved","Basic","Limited","Unimproved","Surface water","Improved","Basic","Limited","Unimproved","Surface water"]
["Forecast period:",null,{"$f":"MinBase(C205:C216)","v":2000},{"$f":"IF((D201+H201)>100,D201*100/(D201+H201),D201)","v":98.881610073513997},{"$f":"D199*AVERAGEIF(E205:E216,\">0\")/100","v":98.740584621527233},{"$f":"D199*(100-AVERAGEIF(E205:E216,\">0\"))/100","v":0.14102545198677213},{"$f":"100-(E199+F199+H199)","v":1.1183899264859889},{"$f":"IF((D201+H201)>100,H201*100/(D201+H201),H201)","v":0},{"$f":"IF((I201+M201)>100,I201*100/(I201+M201),I201)","v":100},{"$f":"I199*AVERAGEIF(J205:J216,\">0\")/100","v":99.987175832535499},{"$f":"I199*(100-AVERAGEIF(J205:J216,\">0\"))/100","v":1.2824167464501102E-2},{"$f":"100-(J199+K199+M199)","v":0},{"$f":"IF((I201+M201)>100,M201*100/(I201+M201),M201)","v":0},{"$f":"IF((N201+R201)>100,N201*100/(N201+R201),N201)","v":100},{"$f":"N199*AVERAGEIF(O205:O216,\">0\")/100","v":99.945103277426938},{"$f":"N199*(100-AVERAGEIF(O205:O216,\">0\"))/100","v":5.4896722573062107E-2},{"$f":"100-(O199+P199+R199)","v":0},{"$f":"IF((N201+R201)>100,R201*100/(N201+R201),R201)","v":0},{"$f":"IF((S201+W201)>100,S201*100/(S201+W201),S201)","v":100},{"$f":"S199*AVERAGEIF(T205:T216,\">0\")/100","v":100},{"$f":"S199*(100-AVERAGEIF(T205:T216,\">0\"))/100","v":0},{"$f":"100-(T199+U199+W199)","v":0},{"$f":"IF((S201+W201)>100,W201*100/(S201+W201),W201)","v":0},{"$f":"IF((X201+AB201)>100,X201*100/(X201+AB201),X201)","v":99.986086350245941},{"$f":"X199*AVERAGEIF(Y205:Y216,\">0\")/100","v":99.953703519353098},{"$f":"X199*(100-AVERAGEIF(Y205:Y216,\">0\"))/100","v":3.2382830892838194E-2},{"$f":"100-(Y199+Z199+AB199)","v":1.3913649754059065E-2},{"$f":"IF((X201+AB201)>100,AB201*100/(X201+AB201),AB201)","v":0}]
[null,null,{"$f":"MaxTarget(C205:C216)","v":2018},{"$f":"IF((D202+H202)>100,D202*100/(D202+H202),D202)","v":99.99924634313345},{"$f":"D200*AVERAGEIF(E205:E216,\">0\")/100","v":99.856626912650952},{"$f":"D200*(100-AVERAGEIF(E205:E216,\">0\"))/100","v":0.14261943048249764},{"$f":"100-(E200+F200+H200)","v":7.5365686655004538E-4},{"$f":"IF((D202+H202)>100,H202*100/(D202+H202),H202)","v":0},{"$f":"IF((I202+M202)>100,I202*100/(I202+M202),I202)","v":99.615730556373848},{"$f":"I200*AVERAGEIF(J205:J216,\">0\")/100","v":99.602955668266318},{"$f":"I200*(100-AVERAGEIF(J205:J216,\">0\"))/100","v":1.2774888107535578E-2},{"$f":"100-(J200+K200+M200)","v":0.38426944362615245},{"$f":"IF((I202+M202)>100,M202*100/(I202+M202),M202)","v":0},{"$f":"IF((N202+R202)>100,N202*100/(N202+R202),N202)","v":100},{"$f":"N200*AVERAGEIF(O205:O216,\">0\")/100","v":99.945103277426938},{"$f":"N200*(100-AVERAGEIF(O205:O216,\">0\"))/100","v":5.4896722573062107E-2},{"$f":"100-(O200+P200+R200)","v":0},{"$f":"IF((N202+R202)>100,R202*100/(N202+R202),R202)","v":0},{"$f":"IF((S202+W202)>100,S202*100/(S202+W202),S202)","v":99.759697778601947},{"$f":"S200*AVERAGEIF(T205:T216,\">0\")/100","v":99.759697778601947},{"$f":"S200*(100-AVERAGEIF(T205:T216,\">0\"))/100","v":0},{"$f":"100-(T200+U200+W200)","v":0.24030222139805346},{"$f":"IF((S202+W202)>100,W202*100/(S202+W202),W202)","v":0},{"$f":"IF((X202+AB202)>100,X202*100/(X202+AB202),X202)","v":99.828081891443674},{"$f":"X200*AVERAGEIF(Y205:Y216,\">0\")/100","v":99.795750233987619},{"$f":"X200*(100-AVERAGEIF(Y205:Y216,\">0\"))/100","v":3.2331657456048352E-2},{"$f":"100-(Y200+Z200+AB200)","v":0.17191810855632639},{"$f":"IF((X202+AB202)>100,AB202*100/(X202+AB202),AB202)","v":0}]
["Regression period:",null,{"$f":"MinRegYear(C199,C205:C216)","v":2003},{"$f":"IF(MAX(C205:C216)-MIN(C205:C216)<5,AVERAGEIF(C205:C216,\">0\",D205:D216),\nIF(FORECAST($C201,D$205:D$216,$C$205:$C$216)<0,0,\nIF(FORECAST($C201,D$205:D$216,$C$205:$C$216)>100,100,\nFORECAST($C201,D$205:D$216,$C$205:$C$216))))","v":98.881610073513997},null,null,null,{"$f":"IF(MAX(C205:C216)-MIN(C205:C216)<5,AVERAGEIF(C205:C216,\">0\",H205:H216),\nIF(FORECAST($C201,H$205:H$216,$C$205:$C$216)<0,0,\nIF(FORECAST($C201,H$205:H$216,$C$205:$C$216)>100,100,\nFORECAST($C201,H$205:H$216,$C$205:$C$216))))","v":0},{"$f":"IF(MAX(C205:C216)-MIN(C205:C216)<5,AVERAGEIF(C205:C216,\">0\",I205:I216),\nIF(FORECAST($C201,I$205:I$216,$C$205:$C$216)<0,0,\nIF(FORECAST($C201,I$205:I$216,$C$205:$C$216)>100,100,\nFORECAST($C201,I$205:I$216,$C$205:$C$216))))","v":100},null,null,null,{"$f":"IF(MAX(C205:C216)-MIN(C205:C216)<5,AVERAGEIF(C205:C216,\">0\",M205:M216),\nIF(FORECAST($C201,M$205:M$216,$C$205:$C$216)<0,0,\nIF(FORECAST($C201,M$205:M$216,$C$205:$C$216)>100,100,\nFORECAST($C201,M$205:M$216,$C$205:$C$216))))","v":0},{"$f":"IF(MAX(C205:C216)-MIN(C205:C216)<5,AVERAGEIF(C205:C216,\">0\",N205:N216),\nIF(FORECAST($C201,N$205:N$216,$C$205:$C$216)<0,0,\nIF(FORECAST($C201,N$205:N$216,$C$205:$C$216)>100,100,\nFORECAST($C201,N$205:N$216,$C$205:$C$216))))","v":100},null,null,null,{"$f":"IF(MAX(C205:C216)-MIN(C205:C216)<5,AVERAGEIF(C205:C216,\">0\",R205:R216),\nIF(FORECAST($C201,R$205:R$216,$C$205:$C$216)<0,0,\nIF(FORECAST($C201,R$205:R$216,$C$205:$C$216)>100,100,\nFORECAST($C201,R$205:R$216,$C$205:$C$216))))","v":0},{"$f":"IF(MAX(C205:C216)-MIN(C205:C216)<5,AVERAGEIF(C205:C216,\">0\",S205:S216),\nIF(FORECAST($C201,S$205:S$216,$C$205:$C$216)<0,0,\nIF(FORECAST($C201,S$205:S$216,$C$205:$C$216)>100,100,\nFORECAST($C201,S$205:S$216,$C$205:$C$216))))","v":100},null,null,null,{"$f":"IF(MAX(C205:C216)-MIN(C205:C216)<5,AVERAGEIF(C205:C216,\">0\",W205:W216),\nIF(FORECAST($C201,W$205:W$216,$C$205:$C$216)<0,0,\nIF(FORECAST($C201,W$205:W$216,$C$205:$C$216)>100,100,\nFORECAST($C201,W$205:W$216,$C$205:$C$216))))","v":0},{"$f":"IF(MAX(C205:C216)-MIN(C205:C216)<5,AVERAGEIF(C205:C216,\">0\",X205:X216),\nIF(FORECAST($C201,X$205:X$216,$C$205:$C$216)<0,0,\nIF(FORECAST($C201,X$205:X$216,$C$205:$C$216)>100,100,\nFORECAST($C201,X$205:X$216,$C$205:$C$216))))","v":99.986086350245941},null,null,null,{"$f":"IF(MAX(C205:C216)-MIN(C205:C216)<5,AVERAGEIF(C205:C216,\">0\",AB205:AB216),\nIF(FORECAST($C201,AB$205:AB$216,$C$205:$C$216)<0,0,\nIF(FORECAST($C201,AB$205:AB$216,$C$205:$C$216)>100,100,\nFORECAST($C201,AB$205:AB$216,$C$205:$C$216))))","v":0}]
[null,null,{"$f":"MaxRegYear(C200,C205:C216)","v":2014},{"$f":"IF(MAX(C205:C216)-MIN(C205:C216)<5,AVERAGEIF(C205:C216,\">0\",D205:D216),\nIF(FORECAST($C202,D$205:D$216,$C$205:$C$216)<0,0,\nIF(FORECAST($C202,D$205:D$216,$C$205:$C$216)>100,100,\nFORECAST($C202,D$205:D$216,$C$205:$C$216))))","v":99.99924634313345},null,null,null,{"$f":"IF(MAX(C205:C216)-MIN(C205:C216)<5,AVERAGEIF(C205:C216,\">0\",H205:H216),\nIF(FORECAST($C202,H$205:H$216,$C$205:$C$216)<0,0,\nIF(FORECAST($C202,H$205:H$216,$C$205:$C$216)>100,100,\nFORECAST($C202,H$205:H$216,$C$205:$C$216))))","v":0},{"$f":"IF(MAX(C205:C216)-MIN(C205:C216)<5,AVERAGEIF(C205:C216,\">0\",I205:I216),\nIF(FORECAST($C202,I$205:I$216,$C$205:$C$216)<0,0,\nIF(FORECAST($C202,I$205:I$216,$C$205:$C$216)>100,100,\nFORECAST($C202,I$205:I$216,$C$205:$C$216))))","v":99.615730556373848},null,null,null,{"$f":"IF(MAX(C205:C216)-MIN(C205:C216)<5,AVERAGEIF(C205:C216,\">0\",M205:M216),\nIF(FORECAST($C202,M$205:M$216,$C$205:$C$216)<0,0,\nIF(FORECAST($C202,M$205:M$216,$C$205:$C$216)>100,100,\nFORECAST($C202,M$205:M$216,$C$205:$C$216))))","v":0},{"$f":"IF(MAX(C205:C216)-MIN(C205:C216)<5,AVERAGEIF(C205:C216,\">0\",N205:N216),\nIF(FORECAST($C202,N$205:N$216,$C$205:$C$216)<0,0,\nIF(FORECAST($C202,N$205:N$216,$C$205:$C$216)>100,100,\nFORECAST($C202,N$205:N$216,$C$205:$C$216))))","v":100},null,null,null,{"$f":"IF(MAX(C205:C216)-MIN(C205:C216)<5,AVERAGEIF(C205:C216,\">0\",R205:R216),\nIF(FORECAST($C202,R$205:R$216,$C$205:$C$216)<0,0,\nIF(FORECAST($C202,R$205:R$216,$C$205:$C$216)>100,100,\nFORECAST($C202,R$205:R$216,$C$205:$C$216))))","v":0},{"$f":"IF(MAX(C205:C216)-MIN(C205:C216)<5,AVERAGEIF(C205:C216,\">0\",S205:S216),\nIF(FORECAST($C202,S$205:S$216,$C$205:$C$216)<0,0,\nIF(FORECAST($C202,S$205:S$216,$C$205:$C$216)>100,100,\nFORECAST($C202,S$205:S$216,$C$205:$C$216))))","v":99.759697778601947},null,null,null,{"$f":"IF(MAX(C205:C216)-MIN(C205:C216)<5,AVERAGEIF(C205:C216,\">0\",W205:W216),\nIF(FORECAST($C202,W$205:W$216,$C$205:$C$216)<0,0,\nIF(FORECAST($C202,W$205:W$216,$C$205:$C$216)>100,100,\nFORECAST($C202,W$205:W$216,$C$205:$C$216))))","v":0},{"$f":"IF(MAX(C205:C216)-MIN(C205:C216)<5,AVERAGEIF(C205:C216,\">0\",X205:X216),\nIF(FORECAST($C202,X$205:X$216,$C$205:$C$216)<0,0,\nIF(FORECAST($C202,X$205:X$216,$C$205:$C$216)>100,100,\nFORECAST($C202,X$205:X$216,$C$205:$C$216))))","v":99.828081891443674},null,null,null,{"$f":"IF(MAX(C205:C216)-MIN(C205:C216)<5,AVERAGEIF(C205:C216,\">0\",AB205:AB216),\nIF(FORECAST($C202,AB$205:AB$216,$C$205:$C$216)<0,0,\nIF(FORECAST($C202,AB$205:AB$216,$C$205:$C$216)>100,100,\nFORECAST($C202,AB$205:AB$216,$C$205:$C$216))))","v":0}]
[]
[null,"Survey","Year","Improved","% Improved\n< = 30min",null,null,"Surface water","Improved","% Improved\n< = 30min",null,null,"Surface water","Improved","% Improved\n< = 30min",null,null,"Surface water","Improved","% Improved\n< = 30min",null,null,"Surface water","Improved","% Improved\n< = 30min",null,null,"Surface water"]
[null,"MICS05",2005,{"$f":"IF(ISERROR(INDIRECT(CONCATENATE($B205,\"!H16\"))),\"\",INDIRECT(CONCATENATE($B205,\"!H16\")))","v":99.084816667990268},{"$f":"IF(ISERROR(INDIRECT(CONCATENATE($B205,\"!H23\"))),\"\",INDIRECT(CONCATENATE($B205,\"!H23\")))","v":99.793904646604076},null,null,{"$f":"IF(ISERROR(INDIRECT(CONCATENATE($B205,\"!H21\"))),\"\",INDIRECT(CONCATENATE($B205,\"!H21\")))","v":0},{"$f":"IF(ISERROR(INDIRECT(CONCATENATE($B205,\"!I16\"))),\"\",INDIRECT(CONCATENATE($B205,\"!I16\")))","v":99.942851436570834},{"$f":"IF(ISERROR(INDIRECT(CONCATENATE($B205,\"!I23\"))),\"\",INDIRECT(CONCATENATE($B205,\"!I23\")))","v":100},null,null,{"$f":"IF(ISERROR(INDIRECT(CONCATENATE($B205,\"!I21\"))),\"\",INDIRECT(CONCATENATE($B205,\"!I21\")))","v":0},{"$f":"IF(ISERROR(INDIRECT(CONCATENATE($B205,\"!J16\"))),\"\",INDIRECT(CONCATENATE($B205,\"!J16\")))","v":100},{"$f":"IF(ISERROR(INDIRECT(CONCATENATE($B205,\"!J23\"))),\"\",INDIRECT(CONCATENATE($B205,\"!J23\")))","v":99.924503840986247},null,null,{"$f":"IF(ISERROR(INDIRECT(CONCATENATE($B205,\"!J21\"))),\"\",INDIRECT(CONCATENATE($B205,\"!J21\")))","v":0},{"$f":"IF(ISERROR(INDIRECT(CONCATENATE($B205,\"!K16\"))),\"\",INDIRECT(CONCATENATE($B205,\"!K16\")))","v":100},{"$f":"IF(ISERROR(INDIRECT(CONCATENATE($B205,\"!K23\"))),\"\",INDIRECT(CONCATENATE($B205,\"!K23\")))","v":100},null,null,{"$f":"IF(ISERROR(INDIRECT(CONCATENATE($B205,\"!K21\"))),\"\",INDIRECT(CONCATENATE($B205,\"!K21\")))","v":0},{"$f":"IF(ISERROR(INDIRECT(CONCATENATE($B205,\"!L16\"))),\"\",INDIRECT(CONCATENATE($B205,\"!L16\")))","v":99.957358266827356},{"$f":"IF(ISERROR(INDIRECT(CONCATENATE($B205,\"!L23\"))),\"\",INDIRECT(CONCATENATE($B205,\"!L23\")))","v":99.935225325693011},null,null,{"$f":"IF(ISERROR(INDIRECT(CONCATENATE($B205,\"!L221\"))),\"\",INDIRECT(CONCATENATE($B205,\"!L21\")))","v":0}]
[null,"MICS12",2012,99.796039748657194,99.920854342692465,null,null,0,99.688424085306508,99.974351665070998,null,null,0,100,99.965702713867628,null,null,0,99.813098272245966,100,null,null,0,99.856809974862273,100,null,null,0]
[null,null,null,"","",null,null,"","","",null,null,"","","",null,null,"","","",null,null,"","","",null,null,""]
[null,null,null,"","",null,null,"","","",null,null,"","","",null,null,"","","",null,null,"","","",null,null,""]
[null,null,null,"","",null,null,"","","",null,null,"","","",null,null,"","","",null,null,"","","",null,null,""]
[null,null,null,"","",null,null,"","","",null,null,"","","",null,null,"","","",null,null,"","","",null,null,""]
[null,null,null,"","",null,null,"","","",null,null,"","","",null,null,"","","",null,null,"","","",null,null,""]
[null,null,null,"","",null,null,"","","",null,null,"","","",null,null,"","","",null,null,"","","",null,null,""]
[null,null,null,"","",null,null,"","","",null,null,"","","",null,null,"","","",null,null,"","","",null,null,""]
[null,null,null,"","",null,null,"","","",null,null,"","","",null,null,"","","",null,null,"","","",null,null,""]
[null,null,null,"","",null,null,"","","",null,null,"","","",null,null,"","","",null,null,"","","",null,null,""]
[null,null,null,"","",null,null,"","","",null,null,"","","",null,null,"","","",null,null,"","","",null,null,""]
[]
[null,{"$f":"CONCATENATE(\"Urban use of drinking water sources,  \",C199,\"–\",C200)","v":"Urban use of drinking water sources,  2000–2018"},null,null,null,null,null,null,null,null,null,null,null,null,null,null,null,null,"Data points used for regression"]
[]
[]
[]
[]
[]
[]
[]
[]
[]
[]
[]
[]
[]
[]
[]
[]
[]
[]
[]
[]
[]
[]
[]
[]
[]
[]
[]
[]
[]
[]
[]
[]
[]
[]
[null,null,null,null,{"$f":"IF(ISERROR(INDIRECT(CONCATENATE($B253,\"!M18\"))),\"\",INDIRECT(CONCATENATE($B253,\"!M18\")))","v":""},{"$f":"IF(ISERROR(INDIRECT(CONCATENATE($B253,\"!M19\"))),\"\",INDIRECT(CONCATENATE($B253,\"!M19\")))","v":""},{"$f":"IF(ISERROR(INDIRECT(CONCATENATE($B253,\"!M20\"))),\"\",INDIRECT(CONCATENATE($B253,\"!M20\")))","v":""},{"$f":"IF(ISERROR(INDIRECT(CONCATENATE($B253,\"!M21\"))),\"\",INDIRECT(CONCATENATE($B253,\"!M21\")))","v":""},null,{"$f":"IF(ISERROR(INDIRECT(CONCATENATE($B253,\"!N18\"))),\"\",INDIRECT(CONCATENATE($B253,\"!N18\")))","v":""},{"$f":"IF(ISERROR(INDIRECT(CONCATENATE($B253,\"!N19\"))),\"\",INDIRECT(CONCATENATE($B253,\"!N19\")))","v":""},{"$f":"IF(ISERROR(INDIRECT(CONCATENATE($B253,\"!N20\"))),\"\",INDIRECT(CONCATENATE($B253,\"!N20\")))","v":""},{"$f":"IF(ISERROR(INDIRECT(CONCATENATE($B253,\"!N21\"))),\"\",INDIRECT(CONCATENATE($B253,\"!N21\")))","v":""},null,{"$f":"IF(ISERROR(INDIRECT(CONCATENATE($B253,\"!O18\"))),\"\",INDIRECT(CONCATENATE($B253,\"!O18\")))","v":""},{"$f":"IF(ISERROR(INDIRECT(CONCATENATE($B253,\"!O19\"))),\"\",INDIRECT(CONCATENATE($B253,\"!O19\")))","v":""},{"$f":"IF(ISERROR(INDIRECT(CONCATENATE($B253,\"!O20\"))),\"\",INDIRECT(CONCATENATE($B253,\"!O20\")))","v":""},{"$f":"IF(ISERROR(INDIRECT(CONCATENATE($B253,\"!O21\"))),\"\",INDIRECT(CONCATENATE($B253,\"!O21\")))","v":""},null,{"$f":"IF(ISERROR(INDIRECT(CONCATENATE($B253,\"!P18\"))),\"\",INDIRECT(CONCATENATE($B253,\"!P18\")))","v":""},{"$f":"IF(ISERROR(INDIRECT(CONCATENATE($B253,\"!P19\"))),\"\",INDIRECT(CONCATENATE($B253,\"!P19\")))","v":""},{"$f":"IF(ISERROR(INDIRECT(CONCATENATE($B253,\"!P20\"))),\"\",INDIRECT(CONCATENATE($B253,\"!P20\")))","v":""},{"$f":"IF(ISERROR(INDIRECT(CONCATENATE($B253,\"!P21\"))),\"\",INDIRECT(CONCATENATE($B253,\"!P21\")))","v":""},null,{"$f":"IF(ISERROR(INDIRECT(CONCATENATE($B253,\"!Q18\"))),\"\",INDIRECT(CONCATENATE($B253,\"!Q18\")))","v":""},{"$f":"IF(ISERROR(INDIRECT(CONCATENATE($B253,\"!Q19\"))),\"\",INDIRECT(CONCATENATE($B253,\"!Q19\")))","v":""},{"$f":"IF(ISERROR(INDIRECT(CONCATENATE($B253,\"!Q20\"))),\"\",INDIRECT(CONCATENATE($B253,\"!Q20\")))","v":""},{"$f":"IF(ISERROR(INDIRECT(CONCATENATE($B253,\"!Q21\"))),\"\",INDIRECT(CONCATENATE($B253,\"!Q1\")))","v":""}]
[null,null,null,null,{"$f":"IF(ISERROR(INDIRECT(CONCATENATE($B254,\"!M18\"))),\"\",INDIRECT(CONCATENATE($B254,\"!M18\")))","v":""},{"$f":"IF(ISERROR(INDIRECT(CONCATENATE($B254,\"!M19\"))),\"\",INDIRECT(CONCATENATE($B254,\"!M19\")))","v":""},{"$f":"IF(ISERROR(INDIRECT(CONCATENATE($B254,\"!M20\"))),\"\",INDIRECT(CONCATENATE($B254,\"!M20\")))","v":""},{"$f":"IF(ISERROR(INDIRECT(CONCATENATE($B254,\"!M21\"))),\"\",INDIRECT(CONCATENATE($B254,\"!M21\")))","v":""},null,{"$f":"IF(ISERROR(INDIRECT(CONCATENATE($B254,\"!N18\"))),\"\",INDIRECT(CONCATENATE($B254,\"!N18\")))","v":""},{"$f":"IF(ISERROR(INDIRECT(CONCATENATE($B254,\"!N19\"))),\"\",INDIRECT(CONCATENATE($B254,\"!N19\")))","v":""},{"$f":"IF(ISERROR(INDIRECT(CONCATENATE($B254,\"!N20\"))),\"\",INDIRECT(CONCATENATE($B254,\"!N20\")))","v":""},{"$f":"IF(ISERROR(INDIRECT(CONCATENATE($B254,\"!N21\"))),\"\",INDIRECT(CONCATENATE($B254,\"!N21\")))","v":""},null,{"$f":"IF(ISERROR(INDIRECT(CONCATENATE($B254,\"!O18\"))),\"\",INDIRECT(CONCATENATE($B254,\"!O18\")))","v":""},{"$f":"IF(ISERROR(INDIRECT(CONCATENATE($B254,\"!O19\"))),\"\",INDIRECT(CONCATENATE($B254,\"!O19\")))","v":""},{"$f":"IF(ISERROR(INDIRECT(CONCATENATE($B254,\"!O20\"))),\"\",INDIRECT(CONCATENATE($B254,\"!O20\")))","v":""},{"$f":"IF(ISERROR(INDIRECT(CONCATENATE($B254,\"!O21\"))),\"\",INDIRECT(CONCATENATE($B254,\"!O21\")))","v":""},null,{"$f":"IF(ISERROR(INDIRECT(CONCATENATE($B254,\"!P18\"))),\"\",INDIRECT(CONCATENATE($B254,\"!P18\")))","v":""},{"$f":"IF(ISERROR(INDIRECT(CONCATENATE($B254,\"!P19\"))),\"\",INDIRECT(CONCATENATE($B254,\"!P19\")))","v":""},{"$f":"IF(ISERROR(INDIRECT(CONCATENATE($B254,\"!P20\"))),\"\",INDIRECT(CONCATENATE($B254,\"!P20\")))","v":""},{"$f":"IF(ISERROR(INDIRECT(CONCATENATE($B254,\"!P21\"))),\"\",INDIRECT(CONCATENATE($B254,\"!P21\")))","v":""},null,{"$f":"IF(ISERROR(INDIRECT(CONCATENATE($B254,\"!Q18\"))),\"\",INDIRECT(CONCATENATE($B254,\"!Q18\")))","v":""},{"$f":"IF(ISERROR(INDIRECT(CONCATENATE($B254,\"!Q19\"))),\"\",INDIRECT(CONCATENATE($B254,\"!Q19\")))","v":""},{"$f":"IF(ISERROR(INDIRECT(CONCATENATE($B254,\"!Q20\"))),\"\",INDIRECT(CONCATENATE($B254,\"!Q20\")))","v":""},{"$f":"IF(ISERROR(INDIRECT(CONCATENATE($B254,\"!Q21\"))),\"\",INDIRECT(CONCATENATE($B254,\"!Q1\")))","v":""}]
[null,null,null,null,{"$f":"IF(ISERROR(INDIRECT(CONCATENATE($B255,\"!M18\"))),\"\",INDIRECT(CONCATENATE($B255,\"!M18\")))","v":""},{"$f":"IF(ISERROR(INDIRECT(CONCATENATE($B255,\"!M19\"))),\"\",INDIRECT(CONCATENATE($B255,\"!M19\")))","v":""},{"$f":"IF(ISERROR(INDIRECT(CONCATENATE($B255,\"!M20\"))),\"\",INDIRECT(CONCATENATE($B255,\"!M20\")))","v":""},{"$f":"IF(ISERROR(INDIRECT(CONCATENATE($B255,\"!M21\"))),\"\",INDIRECT(CONCATENATE($B255,\"!M21\")))","v":""},null,{"$f":"IF(ISERROR(INDIRECT(CONCATENATE($B255,\"!N18\"))),\"\",INDIRECT(CONCATENATE($B255,\"!N18\")))","v":""},{"$f":"IF(ISERROR(INDIRECT(CONCATENATE($B255,\"!N19\"))),\"\",INDIRECT(CONCATENATE($B255,\"!N19\")))","v":""},{"$f":"IF(ISERROR(INDIRECT(CONCATENATE($B255,\"!N20\"))),\"\",INDIRECT(CONCATENATE($B255,\"!N20\")))","v":""},{"$f":"IF(ISERROR(INDIRECT(CONCATENATE($B255,\"!N21\"))),\"\",INDIRECT(CONCATENATE($B255,\"!N21\")))","v":""},null,{"$f":"IF(ISERROR(INDIRECT(CONCATENATE($B255,\"!O18\"))),\"\",INDIRECT(CONCATENATE($B255,\"!O18\")))","v":""},{"$f":"IF(ISERROR(INDIRECT(CONCATENATE($B255,\"!O19\"))),\"\",INDIRECT(CONCATENATE($B255,\"!O19\")))","v":""},{"$f":"IF(ISERROR(INDIRECT(CONCATENATE($B255,\"!O20\"))),\"\",INDIRECT(CONCATENATE($B255,\"!O20\")))","v":""},{"$f":"IF(ISERROR(INDIRECT(CONCATENATE($B255,\"!O21\"))),\"\",INDIRECT(CONCATENATE($B255,\"!O21\")))","v":""},null,{"$f":"IF(ISERROR(INDIRECT(CONCATENATE($B255,\"!P18\"))),\"\",INDIRECT(CONCATENATE($B255,\"!P18\")))","v":""},{"$f":"IF(ISERROR(INDIRECT(CONCATENATE($B255,\"!P19\"))),\"\",INDIRECT(CONCATENATE($B255,\"!P19\")))","v":""},{"$f":"IF(ISERROR(INDIRECT(CONCATENATE($B255,\"!P20\"))),\"\",INDIRECT(CONCATENATE($B255,\"!P20\")))","v":""},{"$f":"IF(ISERROR(INDIRECT(CONCATENATE($B255,\"!P21\"))),\"\",INDIRECT(CONCATENATE($B255,\"!P21\")))","v":""},null,{"$f":"IF(ISERROR(INDIRECT(CONCATENATE($B255,\"!Q18\"))),\"\",INDIRECT(CONCATENATE($B255,\"!Q18\")))","v":""},{"$f":"IF(ISERROR(INDIRECT(CONCATENATE($B255,\"!Q19\"))),\"\",INDIRECT(CONCATENATE($B255,\"!Q19\")))","v":""},{"$f":"IF(ISERROR(INDIRECT(CONCATENATE($B255,\"!Q20\"))),\"\",INDIRECT(CONCATENATE($B255,\"!Q20\")))","v":""},{"$f":"IF(ISERROR(INDIRECT(CONCATENATE($B255,\"!Q21\"))),\"\",INDIRECT(CONCATENATE($B255,\"!Q1\")))","v":""}]
[null,null,null,null,{"$f":"IF(ISERROR(INDIRECT(CONCATENATE($B256,\"!M18\"))),\"\",INDIRECT(CONCATENATE($B256,\"!M18\")))","v":""},{"$f":"IF(ISERROR(INDIRECT(CONCATENATE($B256,\"!M19\"))),\"\",INDIRECT(CONCATENATE($B256,\"!M19\")))","v":""},{"$f":"IF(ISERROR(INDIRECT(CONCATENATE($B256,\"!M20\"))),\"\",INDIRECT(CONCATENATE($B256,\"!M20\")))","v":""},{"$f":"IF(ISERROR(INDIRECT(CONCATENATE($B256,\"!M21\"))),\"\",INDIRECT(CONCATENATE($B256,\"!M21\")))","v":""},null,{"$f":"IF(ISERROR(INDIRECT(CONCATENATE($B256,\"!N18\"))),\"\",INDIRECT(CONCATENATE($B256,\"!N18\")))","v":""},{"$f":"IF(ISERROR(INDIRECT(CONCATENATE($B256,\"!N19\"))),\"\",INDIRECT(CONCATENATE($B256,\"!N19\")))","v":""},{"$f":"IF(ISERROR(INDIRECT(CONCATENATE($B256,\"!N20\"))),\"\",INDIRECT(CONCATENATE($B256,\"!N20\")))","v":""},{"$f":"IF(ISERROR(INDIRECT(CONCATENATE($B256,\"!N21\"))),\"\",INDIRECT(CONCATENATE($B256,\"!N21\")))","v":""},null,{"$f":"IF(ISERROR(INDIRECT(CONCATENATE($B256,\"!O18\"))),\"\",INDIRECT(CONCATENATE($B256,\"!O18\")))","v":""},{"$f":"IF(ISERROR(INDIRECT(CONCATENATE($B256,\"!O19\"))),\"\",INDIRECT(CONCATENATE($B256,\"!O19\")))","v":""},{"$f":"IF(ISERROR(INDIRECT(CONCATENATE($B256,\"!O20\"))),\"\",INDIRECT(CONCATENATE($B256,\"!O20\")))","v":""},{"$f":"IF(ISERROR(INDIRECT(CONCATENATE($B256,\"!O21\"))),\"\",INDIRECT(CONCATENATE($B256,\"!O21\")))","v":""},null,{"$f":"IF(ISERROR(INDIRECT(CONCATENATE($B256,\"!P18\"))),\"\",INDIRECT(CONCATENATE($B256,\"!P18\")))","v":""},{"$f":"IF(ISERROR(INDIRECT(CONCATENATE($B256,\"!P19\"))),\"\",INDIRECT(CONCATENATE($B256,\"!P19\")))","v":""},{"$f":"IF(ISERROR(INDIRECT(CONCATENATE($B256,\"!P20\"))),\"\",INDIRECT(CONCATENATE($B256,\"!P20\")))","v":""},{"$f":"IF(ISERROR(INDIRECT(CONCATENATE($B256,\"!P21\"))),\"\",INDIRECT(CONCATENATE($B256,\"!P21\")))","v":""},null,{"$f":"IF(ISERROR(INDIRECT(CONCATENATE($B256,\"!Q18\"))),\"\",INDIRECT(CONCATENATE($B256,\"!Q18\")))","v":""},{"$f":"IF(ISERROR(INDIRECT(CONCATENATE($B256,\"!Q19\"))),\"\",INDIRECT(CONCATENATE($B256,\"!Q19\")))","v":""},{"$f":"IF(ISERROR(INDIRECT(CONCATENATE($B256,\"!Q20\"))),\"\",INDIRECT(CONCATENATE($B256,\"!Q20\")))","v":""},{"$f":"IF(ISERROR(INDIRECT(CONCATENATE($B256,\"!Q21\"))),\"\",INDIRECT(CONCATENATE($B256,\"!Q1\")))","v":""}]
[null,null,null,null,{"$f":"IF(ISERROR(INDIRECT(CONCATENATE($B257,\"!M18\"))),\"\",INDIRECT(CONCATENATE($B257,\"!M18\")))","v":""},{"$f":"IF(ISERROR(INDIRECT(CONCATENATE($B257,\"!M19\"))),\"\",INDIRECT(CONCATENATE($B257,\"!M19\")))","v":""},{"$f":"IF(ISERROR(INDIRECT(CONCATENATE($B257,\"!M20\"))),\"\",INDIRECT(CONCATENATE($B257,\"!M20\")))","v":""},{"$f":"IF(ISERROR(INDIRECT(CONCATENATE($B257,\"!M21\"))),\"\",INDIRECT(CONCATENATE($B257,\"!M21\")))","v":""},null,{"$f":"IF(ISERROR(INDIRECT(CONCATENATE($B257,\"!N18\"))),\"\",INDIRECT(CONCATENATE($B257,\"!N18\")))","v":""},{"$f":"IF(ISERROR(INDIRECT(CONCATENATE($B257,\"!N19\"))),\"\",INDIRECT(CONCATENATE($B257,\"!N19\")))","v":""},{"$f":"IF(ISERROR(INDIRECT(CONCATENATE($B257,\"!N20\"))),\"\",INDIRECT(CONCATENATE($B257,\"!N20\")))","v":""},{"$f":"IF(ISERROR(INDIRECT(CONCATENATE($B257,\"!N21\"))),\"\",INDIRECT(CONCATENATE($B257,\"!N21\")))","v":""},null,{"$f":"IF(ISERROR(INDIRECT(CONCATENATE($B257,\"!O18\"))),\"\",INDIRECT(CONCATENATE($B257,\"!O18\")))","v":""},{"$f":"IF(ISERROR(INDIRECT(CONCATENATE($B257,\"!O19\"))),\"\",INDIRECT(CONCATENATE($B257,\"!O19\")))","v":""},{"$f":"IF(ISERROR(INDIRECT(CONCATENATE($B257,\"!O20\"))),\"\",INDIRECT(CONCATENATE($B257,\"!O20\")))","v":""},{"$f":"IF(ISERROR(INDIRECT(CONCATENATE($B257,\"!O21\"))),\"\",INDIRECT(CONCATENATE($B257,\"!O21\")))","v":""},null,{"$f":"IF(ISERROR(INDIRECT(CONCATENATE($B257,\"!P18\"))),\"\",INDIRECT(CONCATENATE($B257,\"!P18\")))","v":""},{"$f":"IF(ISERROR(INDIRECT(CONCATENATE($B257,\"!P19\"))),\"\",INDIRECT(CONCATENATE($B257,\"!P19\")))","v":""},{"$f":"IF(ISERROR(INDIRECT(CONCATENATE($B257,\"!P20\"))),\"\",INDIRECT(CONCATENATE($B257,\"!P20\")))","v":""},{"$f":"IF(ISERROR(INDIRECT(CONCATENATE($B257,\"!P21\"))),\"\",INDIRECT(CONCATENATE($B257,\"!P21\")))","v":""},null,{"$f":"IF(ISERROR(INDIRECT(CONCATENATE($B257,\"!Q18\"))),\"\",INDIRECT(CONCATENATE($B257,\"!Q18\")))","v":""},{"$f":"IF(ISERROR(INDIRECT(CONCATENATE($B257,\"!Q19\"))),\"\",INDIRECT(CONCATENATE($B257,\"!Q19\")))","v":""},{"$f":"IF(ISERROR(INDIRECT(CONCATENATE($B257,\"!Q20\"))),\"\",INDIRECT(CONCATENATE($B257,\"!Q20\")))","v":""},{"$f":"IF(ISERROR(INDIRECT(CONCATENATE($B257,\"!Q21\"))),\"\",INDIRECT(CONCATENATE($B257,\"!Q1\")))","v":""}]
[]
[]
[]
[]
[]
[]
[]
[]
[]
[]
[]
[]
[]
[]
[]
[]
[]
[]
[]
[]
[]
[]
[]
[]
[]
[]
[]
[]
[]
[]
[]
[]
[]
[]
[]
[]
[]
[]
[]
["RURAL",null,null,"Poorest",null,null,null,null,"Poor",null,null,null,null,"Middle",null,null,null,null,"Rich",null,null,null,null,"Richest"]
[null,null,null,"Improved","Basic","Limited","Unimproved","Surface water","Improved","Basic","Limited","Unimproved","Surface water","Improved","Basic","Limited","Unimproved","Surface water","Improved","Basic","Limited","Unimproved","Surface water","Improved","Basic","Limited","Unimproved","Surface water"]
["Forecast period:",null,2018,{"$f":"IF((D301+H301)>100,D301*100/(D301+H301),D301)","v":98.050807190490332},{"$f":"D299*AVERAGEIF(E305:E316,\">0\")/100","v":97.915113355381393},{"$f":"D299*(100-AVERAGEIF(E305:E316,\">0\"))/100","v":0.13569383510894018},{"$f":"100-(E299+F299+H299)","v":1.9491928095096682},{"$f":"IF((D301+H301)>100,H301*100/(D301+H301),H301)","v":0},{"$f":"IF((I301+M301)>100,I301*100/(I301+M301),I301)","v":98.699606240383019},{"$f":"I299*AVERAGEIF(J305:J316,\">0\")/100","v":98.343013756251764},{"$f":"I299*(100-AVERAGEIF(J305:J316,\">0\"))/100","v":0.35659248413125},{"$f":"100-(J299+K299+M299)","v":1.3003937596169806},{"$f":"IF((I301+M301)>100,M301*100/(I301+M301),M301)","v":0},{"$f":"IF((N301+R301)>100,N301*100/(N301+R301),N301)","v":98.895948339779082},{"$f":"N299*AVERAGEIF(O305:O316,\">0\")/100","v":98.895948339779082},{"$f":"N299*(100-AVERAGEIF(O305:O316,\">0\"))/100","v":0},{"$f":"100-(O299+P299+R299)","v":1.1040516602209181},{"$f":"IF((N301+R301)>100,R301*100/(N301+R301),R301)","v":0},{"$f":"IF((S301+W301)>100,S301*100/(S301+W301),S301)","v":99.932943770666967},{"$f":"S299*AVERAGEIF(T305:T316,\">0\")/100","v":99.932943770666967},{"$f":"S299*(100-AVERAGEIF(T305:T316,\">0\"))/100","v":0},{"$f":"100-(T299+U299+W299)","v":6.7056229333033457E-2},{"$f":"IF((S301+W301)>100,W301*100/(S301+W301),W301)","v":0},{"$f":"IF((X301+AB301)>100,X301*100/(X301+AB301),X301)","v":99.422081815898281},{"$f":"X299*AVERAGEIF(Y305:Y316,\">0\")/100","v":99.422081815898267},{"$f":"X299*(100-AVERAGEIF(Y305:Y316,\">0\"))/100","v":0},{"$f":"100-(Y299+Z299+AB299)","v":0.57791818410173335},{"$f":"IF((X301+AB301)>100,AB301*100/(X301+AB301),AB301)","v":0}]
[null,null,2020,{"$f":"IF((D302+H302)>100,D302*100/(D302+H302),D302)","v":98.050807190490332},{"$f":"D300*AVERAGEIF(E305:E316,\">0\")/100","v":97.915113355381393},{"$f":"D300*(100-AVERAGEIF(E305:E316,\">0\"))/100","v":0.13569383510894018},{"$f":"100-(E300+F300+H300)","v":1.9491928095096682},{"$f":"IF((D302+H302)>100,H302*100/(D302+H302),H302)","v":0},{"$f":"IF((I302+M302)>100,I302*100/(I302+M302),I302)","v":98.699606240383019},{"$f":"I300*AVERAGEIF(J305:J316,\">0\")/100","v":98.343013756251764},{"$f":"I300*(100-AVERAGEIF(J305:J316,\">0\"))/100","v":0.35659248413125},{"$f":"100-(J300+K300+M300)","v":1.3003937596169806},{"$f":"IF((I302+M302)>100,M302*100/(I302+M302),M302)","v":0},{"$f":"IF((N302+R302)>100,N302*100/(N302+R302),N302)","v":98.895948339779082},{"$f":"N300*AVERAGEIF(O305:O316,\">0\")/100","v":98.895948339779082},{"$f":"N300*(100-AVERAGEIF(O305:O316,\">0\"))/100","v":0},{"$f":"100-(O300+P300+R300)","v":1.1040516602209181},{"$f":"IF((N302+R302)>100,R302*100/(N302+R302),R302)","v":0},{"$f":"IF((S302+W302)>100,S302*100/(S302+W302),S302)","v":99.932943770666967},{"$f":"S300*AVERAGEIF(T305:T316,\">0\")/100","v":99.932943770666967},{"$f":"S300*(100-AVERAGEIF(T305:T316,\">0\"))/100","v":0},{"$f":"100-(T300+U300+W300)","v":6.7056229333033457E-2},{"$f":"IF((S302+W302)>100,W302*100/(S302+W302),W302)","v":0},{"$f":"IF((X302+AB302)>100,X302*100/(X302+AB302),X302)","v":99.422081815898281},{"$f":"X300*AVERAGEIF(Y305:Y316,\">0\")/100","v":99.422081815898267},{"$f":"X300*(100-AVERAGEIF(Y305:Y316,\">0\"))/100","v":0},{"$f":"100-(Y300+Z300+AB300)","v":0.57791818410173335},{"$f":"IF((X302+AB302)>100,AB302*100/(X302+AB302),AB302)","v":0}]
["Regression period:",null,{"$f":"MinRegYear(C299,C305:C316)","v":2014},{"$f":"IF(MAX(C305:C316)-MIN(C305:C316)<5,AVERAGEIF(C305:C316,\">0\",D305:D316),\nIF(FORECAST($C301,D$305:D$316,$C$305:$C$316)<0,0,\nIF(FORECAST($C301,D$305:D$316,$C$305:$C$316)>100,100,\nFORECAST($C301,D$305:D$316,$C$305:$C$316))))","v":98.050807190490332},null,null,null,{"$f":"IF(MAX(C305:C316)-MIN(C305:C316)<5,AVERAGEIF(C305:C316,\">0\",H305:H316),\nIF(FORECAST($C301,H$305:H$316,$C$305:$C$316)<0,0,\nIF(FORECAST($C301,H$305:H$316,$C$305:$C$316)>100,100,\nFORECAST($C301,H$305:H$316,$C$305:$C$316))))","v":0},{"$f":"IF(MAX(C305:C316)-MIN(C305:C316)<5,AVERAGEIF(C305:C316,\">0\",I305:I316),\nIF(FORECAST($C301,I$305:I$316,$C$305:$C$316)<0,0,\nIF(FORECAST($C301,I$305:I$316,$C$305:$C$316)>100,100,\nFORECAST($C301,I$305:I$316,$C$305:$C$316))))","v":98.699606240383019},null,null,null,{"$f":"IF(MAX(C305:C316)-MIN(C305:C316)<5,AVERAGEIF(C305:C316,\">0\",M305:M316),\nIF(FORECAST($C301,M$305:M$316,$C$305:$C$316)<0,0,\nIF(FORECAST($C301,M$305:M$316,$C$305:$C$316)>100,100,\nFORECAST($C301,M$305:M$316,$C$305:$C$316))))","v":0},{"$f":"IF(MAX(C305:C316)-MIN(C305:C316)<5,AVERAGEIF(C305:C316,\">0\",N305:N316),\nIF(FORECAST($C301,N$305:N$316,$C$305:$C$316)<0,0,\nIF(FORECAST($C301,N$305:N$316,$C$305:$C$316)>100,100,\nFORECAST($C301,N$305:N$316,$C$305:$C$316))))","v":98.895948339779082},null,null,null,{"$f":"IF(MAX(C305:C316)-MIN(C305:C316)<5,AVERAGEIF(C305:C316,\">0\",R305:R316),\nIF(FORECAST($C301,R$305:R$316,$C$305:$C$316)<0,0,\nIF(FORECAST($C301,R$305:R$316,$C$305:$C$316)>100,100,\nFORECAST($C301,R$305:R$316,$C$305:$C$316))))","v":0},{"$f":"IF(MAX(C305:C316)-MIN(C305:C316)<5,AVERAGEIF(C305:C316,\">0\",S305:S316),\nIF(FORECAST($C301,S$305:S$316,$C$305:$C$316)<0,0,\nIF(FORECAST($C301,S$305:S$316,$C$305:$C$316)>100,100,\nFORECAST($C301,S$305:S$316,$C$305:$C$316))))","v":99.932943770666967},null,null,null,{"$f":"IF(MAX(C305:C316)-MIN(C305:C316)<5,AVERAGEIF(C305:C316,\">0\",W305:W316),\nIF(FORECAST($C301,W$305:W$316,$C$305:$C$316)<0,0,\nIF(FORECAST($C301,W$305:W$316,$C$305:$C$316)>100,100,\nFORECAST($C301,W$305:W$316,$C$305:$C$316))))","v":0},{"$f":"IF(MAX(C305:C316)-MIN(C305:C316)<5,AVERAGEIF(C305:C316,\">0\",X305:X316),\nIF(FORECAST($C301,X$305:X$316,$C$305:$C$316)<0,0,\nIF(FORECAST($C301,X$305:X$316,$C$305:$C$316)>100,100,\nFORECAST($C301,X$305:X$316,$C$305:$C$316))))","v":99.422081815898281},null,null,null,{"$f":"IF(MAX(C305:C316)-MIN(C305:C316)<5,AVERAGEIF(C305:C316,\">0\",AB305:AB316),\nIF(FORECAST($C301,AB$305:AB$316,$C$305:$C$316)<0,0,\nIF(FORECAST($C301,AB$305:AB$316,$C$305:$C$316)>100,100,\nFORECAST($C301,AB$305:AB$316,$C$305:$C$316))))","v":0}]
[null,null,{"$f":"MaxRegYear(C300,C305:C316)","v":2014},{"$f":"IF(MAX(C305:C316)-MIN(C305:C316)<5,AVERAGEIF(C305:C316,\">0\",D305:D316),\nIF(FORECAST($C302,D$305:D$316,$C$305:$C$316)<0,0,\nIF(FORECAST($C302,D$305:D$316,$C$305:$C$316)>100,100,\nFORECAST($C302,D$305:D$316,$C$305:$C$316))))","v":98.050807190490332},null,null,null,{"$f":"IF(MAX(C305:C316)-MIN(C305:C316)<5,AVERAGEIF(C305:C316,\">0\",H305:H316),\nIF(FORECAST($C302,H$305:H$316,$C$305:$C$316)<0,0,\nIF(FORECAST($C302,H$305:H$316,$C$305:$C$316)>100,100,\nFORECAST($C302,H$305:H$316,$C$305:$C$316))))","v":0},{"$f":"IF(MAX(C305:C316)-MIN(C305:C316)<5,AVERAGEIF(C305:C316,\">0\",I305:I316),\nIF(FORECAST($C302,I$305:I$316,$C$305:$C$316)<0,0,\nIF(FORECAST($C302,I$305:I$316,$C$305:$C$316)>100,100,\nFORECAST($C302,I$305:I$316,$C$305:$C$316))))","v":98.699606240383019},null,null,null,{"$f":"IF(MAX(C305:C316)-MIN(C305:C316)<5,AVERAGEIF(C305:C316,\">0\",M305:M316),\nIF(FORECAST($C302,M$305:M$316,$C$305:$C$316)<0,0,\nIF(FORECAST($C302,M$305:M$316,$C$305:$C$316)>100,100,\nFORECAST($C302,M$305:M$316,$C$305:$C$316))))","v":0},{"$f":"IF(MAX(C305:C316)-MIN(C305:C316)<5,AVERAGEIF(C305:C316,\">0\",N305:N316),\nIF(FORECAST($C302,N$305:N$316,$C$305:$C$316)<0,0,\nIF(FORECAST($C302,N$305:N$316,$C$305:$C$316)>100,100,\nFORECAST($C302,N$305:N$316,$C$305:$C$316))))","v":98.895948339779082},null,null,null,{"$f":"IF(MAX(C305:C316)-MIN(C305:C316)<5,AVERAGEIF(C305:C316,\">0\",R305:R316),\nIF(FORECAST($C302,R$305:R$316,$C$305:$C$316)<0,0,\nIF(FORECAST($C302,R$305:R$316,$C$305:$C$316)>100,100,\nFORECAST($C302,R$305:R$316,$C$305:$C$316))))","v":0},{"$f":"IF(MAX(C305:C316)-MIN(C305:C316)<5,AVERAGEIF(C305:C316,\">0\",S305:S316),\nIF(FORECAST($C302,S$305:S$316,$C$305:$C$316)<0,0,\nIF(FORECAST($C302,S$305:S$316,$C$305:$C$316)>100,100,\nFORECAST($C302,S$305:S$316,$C$305:$C$316))))","v":99.932943770666967},null,null,null,{"$f":"IF(MAX(C305:C316)-MIN(C305:C316)<5,AVERAGEIF(C305:C316,\">0\",W305:W316),\nIF(FORECAST($C302,W$305:W$316,$C$305:$C$316)<0,0,\nIF(FORECAST($C302,W$305:W$316,$C$305:$C$316)>100,100,\nFORECAST($C302,W$305:W$316,$C$305:$C$316))))","v":0},{"$f":"IF(MAX(C305:C316)-MIN(C305:C316)<5,AVERAGEIF(C305:C316,\">0\",X305:X316),\nIF(FORECAST($C302,X$305:X$316,$C$305:$C$316)<0,0,\nIF(FORECAST($C302,X$305:X$316,$C$305:$C$316)>100,100,\nFORECAST($C302,X$305:X$316,$C$305:$C$316))))","v":99.422081815898281},null,null,null,{"$f":"IF(MAX(C305:C316)-MIN(C305:C316)<5,AVERAGEIF(C305:C316,\">0\",AB305:AB316),\nIF(FORECAST($C302,AB$305:AB$316,$C$305:$C$316)<0,0,\nIF(FORECAST($C302,AB$305:AB$316,$C$305:$C$316)>100,100,\nFORECAST($C302,AB$305:AB$316,$C$305:$C$316))))","v":0}]
[]
[null,"Survey","Year","Improved","% Improved\n< = 30min",null,null,"Surface water","Improved","% Improved\n< = 30min",null,null,"Surface water","Improved","% Improved\n< = 30min",null,null,"Surface water","Improved","% Improved\n< = 30min",null,null,"Surface water","Improved","% Improved\n< = 30min",null,null,"Surface water"]
[null,"MICS05",2005,{"$f":"IF(ISERROR(INDIRECT(CONCATENATE($B305,\"!M16\"))),\"\",INDIRECT(CONCATENATE($B305,\"!M16\")))","v":98.297895386308028},{"$f":"IF(ISERROR(INDIRECT(CONCATENATE($B305,\"!M23\"))),\"\",INDIRECT(CONCATENATE($B305,\"!M23\")))","v":100},null,null,{"$f":"IF(ISERROR(INDIRECT(CONCATENATE($B305,\"!M21\"))),\"\",INDIRECT(CONCATENATE($B305,\"!M21\")))","v":0},{"$f":"IF(ISERROR(INDIRECT(CONCATENATE($B305,\"!N16\"))),\"\",INDIRECT(CONCATENATE($B305,\"!N16\")))","v":98.675599898484407},{"$f":"IF(ISERROR(INDIRECT(CONCATENATE($B305,\"!N23\"))),\"\",INDIRECT(CONCATENATE($B305,\"!N23\")))","v":100},null,null,{"$f":"IF(ISERROR(INDIRECT(CONCATENATE($B305,\"!N21\"))),\"\",INDIRECT(CONCATENATE($B305,\"!N21\")))","v":0},{"$f":"IF(ISERROR(INDIRECT(CONCATENATE($B305,\"!O16\"))),\"\",INDIRECT(CONCATENATE($B305,\"!O16\")))","v":99.401109117264042},{"$f":"IF(ISERROR(INDIRECT(CONCATENATE($B305,\"!O23\"))),\"\",INDIRECT(CONCATENATE($B305,\"!O23\")))","v":100},null,null,{"$f":"IF(ISERROR(INDIRECT(CONCATENATE($B305,\"!O21\"))),\"\",INDIRECT(CONCATENATE($B305,\"!O21\")))","v":0},{"$f":"IF(ISERROR(INDIRECT(CONCATENATE($B305,\"!P16\"))),\"\",INDIRECT(CONCATENATE($B305,\"!P16\")))","v":100},{"$f":"IF(ISERROR(INDIRECT(CONCATENATE($B305,\"!P23\"))),\"\",INDIRECT(CONCATENATE($B305,\"!P23\")))","v":100},null,null,{"$f":"IF(ISERROR(INDIRECT(CONCATENATE($B305,\"!P21\"))),\"\",INDIRECT(CONCATENATE($B305,\"!P21\")))","v":0},{"$f":"IF(ISERROR(INDIRECT(CONCATENATE($B305,\"!Q16\"))),\"\",INDIRECT(CONCATENATE($B305,\"!Q16\")))","v":100},{"$f":"IF(ISERROR(INDIRECT(CONCATENATE($B305,\"!Q23\"))),\"\",INDIRECT(CONCATENATE($B305,\"!Q23\")))","v":100},null,null,{"$f":"IF(ISERROR(INDIRECT(CONCATENATE($B305,\"!Q221\"))),\"\",INDIRECT(CONCATENATE($B305,\"!Q21\")))","v":0}]
[null,"MICS12",2012,98.105715678449812,99.723217301321512,null,null,0,98.694271497738882,99.277418628676656,null,null,0,99.008206290331316,100,null,null,0,99.94784515496319,100,null,null,0,99.550508079031985,100,null,null,0]
[null,null,null,"","",null,null,"","","",null,null,"","","",null,null,"","","",null,null,"","","",null,null,""]
[null,null,null,"","",null,null,"","","",null,null,"","","",null,null,"","","",null,null,"","","",null,null,""]
[null,null,null,"","",null,null,"","","",null,null,"","","",null,null,"","","",null,null,"","","",null,null,""]
[null,null,null,"","",null,null,"","","",null,null,"","","",null,null,"","","",null,null,"","","",null,null,""]
[null,null,null,"","",null,null,"","","",null,null,"","","",null,null,"","","",null,null,"","","",null,null,""]
[null,null,null,"","",null,null,"","","",null,null,"","","",null,null,"","","",null,null,"","","",null,null,""]
[null,null,null,"","",null,null,"","","",null,null,"","","",null,null,"","","",null,null,"","","",null,null,""]
[null,null,null,"","",null,null,"","","",null,null,"","","",null,null,"","","",null,null,"","","",null,null,""]
[null,null,null,"","",null,null,"","","",null,null,"","","",null,null,"","","",null,null,"","","",null,null,""]
[null,null,null,"","",null,null,"","","",null,null,"","","",null,null,"","","",null,null,"","","",null,null,""]
[]
[null,{"$f":"CONCATENATE(\"Rural use of drinking water sources, \",C299,\"–\",C300)","v":"Rural use of drinking water sources, 2018–2020"},null,null,null,null,null,null,null,null,null,null,null,null,null,null,null,null,"Data points used for regression"]

{"sheet":"Sanitation","index":2,"n_rows":318,"n_cols":28,"rows_kept":318,"cut":false,"hidden":false,"merged":[[30,21,30,24],[4,1,4,24],[3,1,3,24],[6,1,6,8],[6,9,6,16],[6,17,6,24],[30,1,31,4],[30,5,30,8],[30,9,30,12],[30,13,30,16],[30,17,30,20],[96,23,96,27],[32,1,33,2],[32,3,33,3],[35,1,36,2],[35,3,36,3],[38,1,39,2],[38,3,39,3],[96,0,97,2],[96,3,96,7],[96,8,96,12],[96,13,96,17],[96,18,96,22],[98,0,99,1],[100,0,101,1],[117,18,117,22],[196,0,197,2],[196,3,196,7],[196,8,196,12],[196,13,196,17],[196,18,196,22],[117,1,117,11],[298,0,299,1],[300,0,301,1],[317,18,317,22],[196,23,196,27],[198,0,199,1],[200,0,201,1],[217,18,217,22],[296,0,297,2],[296,3,296,7],[296,8,296,12],[296,13,296,17],[296,18,296,22],[296,23,296,27],[217,1,217,11],[317,1,317,11]]}
[]
[]
[]
[null,"Summary of trends in use of sanitation facilities by wealth quintile (%)"]
[null,{"$f":"IF(ISERROR(INDIRECT(CONCATENATE($B105,\"!A2\"))),\"\",INDIRECT(CONCATENATE($B105,\"!A2\")))","v":"Belarus"}]
[]
[null,{"$f":"B118","v":"National use of sanitation facilities, 2000–2018"},null,null,null,null,null,null,null,{"$f":"B218","v":"Urban use of sanitation facilities, 2000–2018"},null,null,null,null,null,null,null,{"$f":"B318","v":"Rural use of sanitation facilities, 2000–2018"}]
[]
[]
[]
[]
[]
[]
[]
[]
[]
[]
[]
[]
[]
[]
[]
[]
[]
[]
[]
[]
[]
[]
[]
[null,{"$f":"IF(ISERROR(INDIRECT(CONCATENATE($B105,\"!A2\"))),\"\",INDIRECT(CONCATENATE($B105,\"!A2\")))","v":"Belarus"},null,null,null,"Poorest",null,null,null,"Poor",null,null,null,"Middle",null,null,null,"Rich",null,null,null,"Richest"]
[null,null,null,null,null,"Basic","Limited","Unimproved","Open defecation","Basic","Limited","Unimproved","Open defecation","Basic","Limited","Unimproved","Open defecation","Basic","Limited","Unimproved","Open defecation","Basic","Limited","Unimproved","Open defecation"]
[null,"NATIONAL",null,"Estimate",{"$f":"C99","v":2000},{"$f":"E99","v":94.53847686842046},{"$f":"F99","v":4.7956950241182685},0.66582810746126597,0,{"$f":"J99","v":94.766935503594581},{"$f":"K99","v":4.0425446938341851},1.1905198025712309,0,{"$f":"O99","v":93.696681576602529},{"$f":"P99","v":6.1629656071135415},0.14035281628392227,0,{"$f":"T99","v":96.014738936570424},{"$f":"U99","v":3.9852610634295758},0,0,{"$f":"Y99","v":96.251520182859451},{"$f":"Z99","v":3.7484798171405487},0,0]
[null,null,null,null,{"$f":"C100","v":2018},{"$f":"E100","v":88.810342534120778},4.5051214266325008,6.6845360392467228,0,{"$f":"J100","v":93.932324798321062},4.0069420750506257,2.0607331266283069,0,{"$f":"O100","v":93.398289997182786},6.1433386895912507,0.45837131322596747,0,{"$f":"T100","v":96.014738936570424},3.9852610634295758,0,0,{"$f":"Y100","v":96.251520182859451},3.7484798171405487,0,0]
[]
[null,"URBAN",null,"Estimate",{"$f":"C199","v":2000},{"$f":"E199","v":90.190580533523075},{"$f":"F199","v":7.7267118875550151},2.0827075789219123,0,{"$f":"J199","v":91.652365951353403},{"$f":"K199","v":8.3476340486465972},0,0,{"$f":"O199","v":95.686765106200909},{"$f":"P199","v":4.3132348937990912},0,0,{"$f":"T199","v":95.486318010581783},{"$f":"U199","v":4.5136819894182167},0,0,{"$f":"Y199","v":96.408818523709002},{"$f":"Z199","v":3.5911814762909984},0,0]
[null,null,null,null,{"$f":"C200","v":2018},{"$f":"E200","v":89.770639555324294},7.6907351488631717,2.5386252958125368,0,{"$f":"J200","v":90.922336691131662},8.281143488955319,0.79651981991301568,0,{"$f":"O200","v":95.686765106200909},4.3132348937990912,0,0,{"$f":"T200","v":95.486318010581783},4.5136819894182167,0,0,{"$f":"Y200","v":96.408818523709002},3.5911814762909984,0,0]
[]
[null,"RURAL",null,"Estimate",{"$f":"C299","v":2000},{"$f":"E299","v":97.694950551358176},{"$f":"F299","v":2.3050494486418245},0,0,{"$f":"J299","v":96.135331213248051},{"$f":"K299","v":2.9027567836148958},0.96191200313705849,0,{"$f":"O299","v":97.489870259189587},{"$f":"P299","v":2.5101297408104131},0,0,{"$f":"T299","v":96.882100140420334},{"$f":"U299","v":2.3053972871365951},0.81250257244306567,0,{"$f":"Y299","v":98.859555334543401},{"$f":"Z299","v":0.7643072916241952},0.37613737383240675,0]
[null,null,null,null,{"$f":"C300","v":2018},{"$f":"E300","v":87.698199827036262},2.0691825526020513,10.23261762036168,0,{"$f":"J300","v":90.525769122691358},2.7333789471215382,6.7408519301871053,0,{"$f":"O300","v":92.370097524018959},2.3783079035818351,5.251594572399199,0,{"$f":"T300","v":95.31063253131471},2.2680027926158921,2.4213646760694019,0,{"$f":"Y300","v":99.055189402088743},0.76581978623140856,0.17899081167985287,0]
[]
[]
[]
[]
[]
[]
[]
[]
[]
[]
[]
[]
[]
[]
[]
[]
[]
[]
[]
[]
[]
[]
[]
[]
[]
[]
[]
[]
[]
[]
[]
[]
[]
[]
[]
[]
[]
[]
[]
[]
[]
[]
[]
[]
[]
[]
[]
[]
[]
[]
[]
[]
[]
[]
[]
[]
["NATIONAL",null,null,"Poorest",null,null,null,null,"Poor",null,null,null,null,"Middle",null,null,null,null,"Rich",null,null,null,null,"Richest"]
[null,null,null,"Improved","Basic","Limited","Unimproved","Open defecation","Improved","Basic","Limited","Unimproved","Open defecation","Improved","Basic","Limited","Unimproved","Open defecation","Improved","Basic","Limited","Unimproved","Open defecation","Improved","Basic","Limited","Unimproved","Open defecation"]
["Forecast period:",null,{"$f":"MinBase(C105:C116)","v":2000},{"$f":"IF((D101+H101)>100,D101*100/(D101+H101),D101)","v":99.334171892538734},{"$f":"D99*AVERAGEIF(E105:E116,\">0\")/100","v":94.53847686842046},{"$f":"D99*(100-AVERAGEIF(E105:E116,\">0\"))/100","v":4.7956950241182685},{"$f":"100-(E99+F99+H99)","v":0.66582810746126597},{"$f":"IF((D101+H101)>100,H101*100/(D101+H101),H101)","v":0},{"$f":"IF((I101+M101)>100,I101*100/(I101+M101),I101)","v":98.809480197428769},{"$f":"I99*AVERAGEIF(J105:J116,\">0\")/100","v":94.766935503594581},{"$f":"I99*(100-AVERAGEIF(J105:J116,\">0\"))/100","v":4.0425446938341851},{"$f":"100-(J99+K99+M99)","v":1.1905198025712309},{"$f":"IF((I101+M101)>100,M101*100/(I101+M101),M101)","v":0},{"$f":"IF((N101+R101)>100,N101*100/(N101+R101),N101)","v":99.859647183716078},{"$f":"N99*AVERAGEIF(O105:O116,\">0\")/100","v":93.696681576602529},{"$f":"N99*(100-AVERAGEIF(O105:O116,\">0\"))/100","v":6.1629656071135415},{"$f":"100-(O99+P99+R99)","v":0.14035281628392227},{"$f":"IF((N101+R101)>100,R101*100/(N101+R101),R101)","v":0},{"$f":"IF((S101+W101)>100,S101*100/(S101+W101),S101)","v":100},{"$f":"S99*AVERAGEIF(T105:T116,\">0\")/100","v":96.014738936570424},{"$f":"S99*(100-AVERAGEIF(T105:T116,\">0\"))/100","v":3.9852610634295758},{"$f":"100-(T99+U99+W99)","v":0},{"$f":"IF((S101+W101)>100,W101*100/(S101+W101),W101)","v":0},{"$f":"IF((X101+AB101)>100,X101*100/(X101+AB101),X101)","v":100},{"$f":"X99*AVERAGEIF(Y105:Y116,\">0\")/100","v":96.251520182859451},{"$f":"X99*(100-AVERAGEIF(Y105:Y116,\">0\"))/100","v":3.7484798171405487},{"$f":"100-(Y99+Z99+AB99)","v":0},{"$f":"IF((X101+AB101)>100,AB101*100/(X101+AB101),AB101)","v":0}]
[null,null,{"$f":"MaxTarget(C105:C116)","v":2018},{"$f":"IF((D102+H102)>100,D102*100/(D102+H102),D102)","v":93.315463960753277},{"$f":"D100*AVERAGEIF(E105:E116,\">0\")/100","v":88.810342534120778},{"$f":"D100*(100-AVERAGEIF(E105:E116,\">0\"))/100","v":4.5051214266325008},{"$f":"100-(E100+F100+H100)","v":6.6845360392467228},{"$f":"IF((D102+H102)>100,H102*100/(D102+H102),H102)","v":0},{"$f":"IF((I102+M102)>100,I102*100/(I102+M102),I102)","v":97.939266873371679},{"$f":"I100*AVERAGEIF(J105:J116,\">0\")/100","v":93.932324798321062},{"$f":"I100*(100-AVERAGEIF(J105:J116,\">0\"))/100","v":4.0069420750506257},{"$f":"100-(J100+K100+M100)","v":2.0607331266283069},{"$f":"IF((I102+M102)>100,M102*100/(I102+M102),M102)","v":0},{"$f":"IF((N102+R102)>100,N102*100/(N102+R102),N102)","v":99.541628686774033},{"$f":"N100*AVERAGEIF(O105:O116,\">0\")/100","v":93.398289997182786},{"$f":"N100*(100-AVERAGEIF(O105:O116,\">0\"))/100","v":6.1433386895912507},{"$f":"100-(O100+P100+R100)","v":0.45837131322596747},{"$f":"IF((N102+R102)>100,R102*100/(N102+R102),R102)","v":0},{"$f":"IF((S102+W102)>100,S102*100/(S102+W102),S102)","v":100},{"$f":"S100*AVERAGEIF(T105:T116,\">0\")/100","v":96.014738936570424},{"$f":"S100*(100-AVERAGEIF(T105:T116,\">0\"))/100","v":3.9852610634295758},{"$f":"100-(T100+U100+W100)","v":0},{"$f":"IF((S102+W102)>100,W102*100/(S102+W102),W102)","v":0},{"$f":"IF((X102+AB102)>100,X102*100/(X102+AB102),X102)","v":100},{"$f":"X100*AVERAGEIF(Y105:Y116,\">0\")/100","v":96.251520182859451},{"$f":"X100*(100-AVERAGEIF(Y105:Y116,\">0\"))/100","v":3.7484798171405487},{"$f":"100-(Y100+Z100+AB100)","v":0},{"$f":"IF((X102+AB102)>100,AB102*100/(X102+AB102),AB102)","v":0}]
["Regression period:",null,{"$f":"MinRegYear(C99,C105:C116)","v":2003},{"$f":"IF(MAX(C105:C116)-MIN(C105:C116)<5,AVERAGEIF(C105:C116,\">0\",D105:D116),\nIF(FORECAST($C101,D$105:D$116,$C$105:$C$116)<0,0,\nIF(FORECAST($C101,D$105:D$116,$C$105:$C$116)>100,100,\nFORECAST($C101,D$105:D$116,$C$105:$C$116))))","v":99.334171892538734},null,null,null,{"$f":"IF(MAX(C105:C116)-MIN(C105:C116)<5,AVERAGEIF(C105:C116,\">0\",H105:H116),\nIF(FORECAST($C101,H$105:H$116,$C$105:$C$116)<0,0,\nIF(FORECAST($C101,H$105:H$116,$C$105:$C$116)>100,100,\nFORECAST($C101,H$105:H$116,$C$105:$C$116))))","v":0},{"$f":"IF(MAX(C105:C116)-MIN(C105:C116)<5,AVERAGEIF(C105:C116,\">0\",I105:I116),\nIF(FORECAST($C101,I$105:I$116,$C$105:$C$116)<0,0,\nIF(FORECAST($C101,I$105:I$116,$C$105:$C$116)>100,100,\nFORECAST($C101,I$105:I$116,$C$105:$C$116))))","v":98.809480197428769},null,null,null,{"$f":"IF(MAX(C105:C116)-MIN(C105:C116)<5,AVERAGEIF(C105:C116,\">0\",M105:M116),\nIF(FORECAST($C101,M$105:M$116,$C$105:$C$116)<0,0,\nIF(FORECAST($C101,M$105:M$116,$C$105:$C$116)>100,100,\nFORECAST($C101,M$105:M$116,$C$105:$C$116))))","v":0},{"$f":"IF(MAX(C105:C116)-MIN(C105:C116)<5,AVERAGEIF(C105:C116,\">0\",N105:N116),\nIF(FORECAST($C101,N$105:N$116,$C$105:$C$116)<0,0,\nIF(FORECAST($C101,N$105:N$116,$C$105:$C$116)>100,100,\nFORECAST($C101,N$105:N$116,$C$105:$C$116))))","v":99.859647183716078},null,null,null,{"$f":"IF(MAX(C105:C116)-MIN(C105:C116)<5,AVERAGEIF(C105:C116,\">0\",R105:R116),\nIF(FORECAST($C101,R$105:R$116,$C$105:$C$116)<0,0,\nIF(FORECAST($C101,R$105:R$116,$C$105:$C$116)>100,100,\nFORECAST($C101,R$105:R$116,$C$105:$C$116))))","v":0},{"$f":"IF(MAX(C105:C116)-MIN(C105:C116)<5,AVERAGEIF(C105:C116,\">0\",S105:S116),\nIF(FORECAST($C101,S$105:S$116,$C$105:$C$116)<0,0,\nIF(FORECAST($C101,S$105:S$116,$C$105:$C$116)>100,100,\nFORECAST($C101,S$105:S$116,$C$105:$C$116))))","v":100},null,null,null,{"$f":"IF(MAX(C105:C116)-MIN(C105:C116)<5,AVERAGEIF(C105:C116,\">0\",W105:W116),\nIF(FORECAST($C101,W$105:W$116,$C$105:$C$116)<0,0,\nIF(FORECAST($C101,W$105:W$116,$C$105:$C$116)>100,100,\nFORECAST($C101,W$105:W$116,$C$105:$C$116))))","v":0},{"$f":"IF(MAX(C105:C116)-MIN(C105:C116)<5,AVERAGEIF(C105:C116,\">0\",X105:X116),\nIF(FORECAST($C101,X$105:X$116,$C$105:$C$116)<0,0,\nIF(FORECAST($C101,X$105:X$116,$C$105:$C$116)>100,100,\nFORECAST($C101,X$105:X$116,$C$105:$C$116))))","v":100},null,null,null,{"$f":"IF(MAX(C105:C116)-MIN(C105:C116)<5,AVERAGEIF(C105:C116,\">0\",AB105:AB116),\nIF(FORECAST($C101,AB$105:AB$116,$C$105:$C$116)<0,0,\nIF(FORECAST($C101,AB$105:AB$116,$C$105:$C$116)>100,100,\nFORECAST($C101,AB$105:AB$116,$C$105:$C$116))))","v":0}]
[null,null,{"$f":"MaxRegYear(C100,C105:C116)","v":2014},{"$f":"IF(MAX(C105:C116)-MIN(C105:C116)<5,AVERAGEIF(C105:C116,\">0\",D105:D116),\nIF(FORECAST($C102,D$105:D$116,$C$105:$C$116)<0,0,\nIF(FORECAST($C102,D$105:D$116,$C$105:$C$116)>100,100,\nFORECAST($C102,D$105:D$116,$C$105:$C$116))))","v":93.315463960753277},null,null,null,{"$f":"IF(MAX(C105:C116)-MIN(C105:C116)<5,AVERAGEIF(C105:C116,\">0\",H105:H116),\nIF(FORECAST($C102,H$105:H$116,$C$105:$C$116)<0,0,\nIF(FORECAST($C102,H$105:H$116,$C$105:$C$116)>100,100,\nFORECAST($C102,H$105:H$116,$C$105:$C$116))))","v":0},{"$f":"IF(MAX(C105:C116)-MIN(C105:C116)<5,AVERAGEIF(C105:C116,\">0\",I105:I116),\nIF(FORECAST($C102,I$105:I$116,$C$105:$C$116)<0,0,\nIF(FORECAST($C102,I$105:I$116,$C$105:$C$116)>100,100,\nFORECAST($C102,I$105:I$116,$C$105:$C$116))))","v":97.939266873371679},null,null,null,{"$f":"IF(MAX(C105:C116)-MIN(C105:C116)<5,AVERAGEIF(C105:C116,\">0\",M105:M116),\nIF(FORECAST($C102,M$105:M$116,$C$105:$C$116)<0,0,\nIF(FORECAST($C102,M$105:M$116,$C$105:$C$116)>100,100,\nFORECAST($C102,M$105:M$116,$C$105:$C$116))))","v":0},{"$f":"IF(MAX(C105:C116)-MIN(C105:C116)<5,AVERAGEIF(C105:C116,\">0\",N105:N116),\nIF(FORECAST($C102,N$105:N$116,$C$105:$C$116)<0,0,\nIF(FORECAST($C102,N$105:N$116,$C$105:$C$116)>100,100,\nFORECAST($C102,N$105:N$116,$C$105:$C$116))))","v":99.541628686774033},null,null,null,{"$f":"IF(MAX(C105:C116)-MIN(C105:C116)<5,AVERAGEIF(C105:C116,\">0\",R105:R116),\nIF(FORECAST($C102,R$105:R$116,$C$105:$C$116)<0,0,\nIF(FORECAST($C102,R$105:R$116,$C$105:$C$116)>100,100,\nFORECAST($C102,R$105:R$116,$C$105:$C$116))))","v":0},{"$f":"IF(MAX(C105:C116)-MIN(C105:C116)<5,AVERAGEIF(C105:C116,\">0\",S105:S116),\nIF(FORECAST($C102,S$105:S$116,$C$105:$C$116)<0,0,\nIF(FORECAST($C102,S$105:S$116,$C$105:$C$116)>100,100,\nFORECAST($C102,S$105:S$116,$C$105:$C$116))))","v":100},null,null,null,{"$f":"IF(MAX(C105:C116)-MIN(C105:C116)<5,AVERAGEIF(C105:C116,\">0\",W105:W116),\nIF(FORECAST($C102,W$105:W$116,$C$105:$C$116)<0,0,\nIF(FORECAST($C102,W$105:W$116,$C$105:$C$116)>100,100,\nFORECAST($C102,W$105:W$116,$C$105:$C$116))))","v":0},{"$f":"IF(MAX(C105:C116)-MIN(C105:C116)<5,AVERAGEIF(C105:C116,\">0\",X105:X116),\nIF(FORECAST($C102,X$105:X$116,$C$105:$C$116)<0,0,\nIF(FORECAST($C102,X$105:X$116,$C$105:$C$116)>100,100,\nFORECAST($C102,X$105:X$116,$C$105:$C$116))))","v":100},null,null,null,{"$f":"IF(MAX(C105:C116)-MIN(C105:C116)<5,AVERAGEIF(C105:C116,\">0\",AB105:AB116),\nIF(FORECAST($C102,AB$105:AB$116,$C$105:$C$116)<0,0,\nIF(FORECAST($C102,AB$105:AB$116,$C$105:$C$116)>100,100,\nFORECAST($C102,AB$105:AB$116,$C$105:$C$116))))","v":0}]
[]
[null,"Survey","Year","Improved","Not shared",null,null,"Open defecation","Improved","Not shared",null,null,"Open defecation","Improved","Not shared",null,null,"Open defecation","Improved","Not shared",null,null,"Open defecation","Improved","Not shared",null,null,"Open defecation"]
[null,"MICS05",2005,{"$f":"IF(ISERROR(INDIRECT(CONCATENATE($B105,\"!C122\"))),\"\",INDIRECT(CONCATENATE($B105,\"!C122\")))","v":98.239861359486994},{"$f":"IF(ISERROR(INDIRECT(CONCATENATE($B105,\"!C129\"))),\"\",INDIRECT(CONCATENATE($B105,\"!C129\")))","v":94.064850669331463},null,null,{"$f":"IF(ISERROR(INDIRECT(CONCATENATE($B105,\"!C127\"))),\"\",INDIRECT(CONCATENATE($B105,\"!C127\")))","v":0},{"$f":"IF(ISERROR(INDIRECT(CONCATENATE($B105,\"!D122\"))),\"\",INDIRECT(CONCATENATE($B105,\"!D122\")))","v":98.651259593054718},{"$f":"IF(ISERROR(INDIRECT(CONCATENATE($B105,\"!D129\"))),\"\",INDIRECT(CONCATENATE($B105,\"!D129\")))","v":95.302798923548806},null,null,{"$f":"IF(ISERROR(INDIRECT(CONCATENATE($B105,\"!D127\"))),\"\",INDIRECT(CONCATENATE($B105,\"!D127\")))","v":0},{"$f":"IF(ISERROR(INDIRECT(CONCATENATE($B105,\"!E122\"))),\"\",INDIRECT(CONCATENATE($B105,\"!E122\")))","v":99.801825638817519},{"$f":"IF(ISERROR(INDIRECT(CONCATENATE($B105,\"!E129\"))),\"\",INDIRECT(CONCATENATE($B105,\"!E129\")))","v":91.265613152209809},null,null,{"$f":"IF(ISERROR(INDIRECT(CONCATENATE($B105,\"!E127\"))),\"\",INDIRECT(CONCATENATE($B105,\"!E127\")))","v":0},{"$f":"IF(ISERROR(INDIRECT(CONCATENATE($B105,\"!F122\"))),\"\",INDIRECT(CONCATENATE($B105,\"!F122\")))","v":100},{"$f":"IF(ISERROR(INDIRECT(CONCATENATE($B105,\"!F129\"))),\"\",INDIRECT(CONCATENATE($B105,\"!F129\")))","v":94.12108547501353},null,null,{"$f":"IF(ISERROR(INDIRECT(CONCATENATE($B105,\"!F127\"))),\"\",INDIRECT(CONCATENATE($B105,\"!F127\")))","v":0},{"$f":"IF(ISERROR(INDIRECT(CONCATENATE($B105,\"!G122\"))),\"\",INDIRECT(CONCATENATE($B105,\"!G122\")))","v":100},{"$f":"IF(ISERROR(INDIRECT(CONCATENATE($B105,\"!G129\"))),\"\",INDIRECT(CONCATENATE($B105,\"!G129\")))","v":93.44143185284338},null,null,{"$f":"IF(ISERROR(INDIRECT(CONCATENATE($B105,\"!G2127\"))),\"\",INDIRECT(CONCATENATE($B105,\"!G127\")))","v":0}]
[null,"MICS12",2012,94.409774493805244,96.279469049151061,null,null,0,98.097487477745673,96.514697361712734,null,null,0,99.599450231672577,96.391131527099418,null,null,0,100,97.908392398127319,null,null,0,100,99.061608512875509,null,null,0]
[null,null,null,"","",null,null,"","","",null,null,"","","",null,null,"","","",null,null,"","","",null,null,""]
[null,null,null,"","",null,null,"","","",null,null,"","","",null,null,"","","",null,null,"","","",null,null,""]
[null,null,null,"","",null,null,"","","",null,null,"","","",null,null,"","","",null,null,"","","",null,null,""]
[null,null,null,"","",null,null,"","","",null,null,"","","",null,null,"","","",null,null,"","","",null,null,""]
[null,null,null,"","",null,null,"","","",null,null,"","","",null,null,"","","",null,null,"","","",null,null,""]
[null,null,null,"","",null,null,"","","",null,null,"","","",null,null,"","","",null,null,"","","",null,null,""]
[null,null,null,"","",null,null,"","","",null,null,"","","",null,null,"","","",null,null,"","","",null,null,""]
[null,null,null,"","",null,null,"","","",null,null,"","","",null,null,"","","",null,null,"","","",null,null,""]
[null,null,null,"","",null,null,"","","",null,null,"","","",null,null,"","","",null,null,"","","",null,null,""]
[null,null,null,"","",null,null,"","","",null,null,"","","",null,null,"","","",null,null,"","","",null,null,""]
[]
[null,{"$f":"CONCATENATE(\"National use of sanitation facilities, \",C99,\"–\",C100)","v":"National use of sanitation facilities, 2000–2018"},null,null,null,null,null,null,null,null,null,null,null,null,null,null,null,null,"Data points used for regression"]
[]
[]
[]
[]
[]
[]
[]
[]
[]
[]
[]
[]
[]
[]
[]
[]
[]
[]
[]
[]
[]
[]
[]
[]
[]
[]
[]
[]
[]
[]
[]
[]
[]
[]
[]
[]
[]
[]
[]
[]
[]
[]
[]
[]
[]
[]
[]
[]
[]
[]
[]
[]
[]
[]
[]
[]
[]
[]
[]
[]
[]
[]
[]
[]
[]
[]
[]
[]
[]
[]
[]
[]
[]
[]
[]
[]
[]
[]
["URBAN",null,null,"Poorest",null,null,null,null,"Poor",null,null,null,null,"Middle",null,null,null,null,"Rich",null,null,null,null,"Richest"]
[null,null,null,"Improved","Basic","Limited","Unimproved","Open defecation","Improved","Basic","Limited","Unimproved","Open defecation","Improved","Basic","Limited","Unimproved","Open defecation","Improved","Basic","Limited","Unimproved","Open defecation","Improved","Basic","Limited","Unimproved","Open defecation"]
["Forecast period:",null,{"$f":"MinBase(C205:C216)","v":2000},{"$f":"IF((D201+H201)>100,D201*100/(D201+H201),D201)","v":97.917292421078102},{"$f":"D199*AVERAGEIF(E205:E216,\">0\")/100","v":90.190580533523075},{"$f":"D199*(100-AVERAGEIF(E205:E216,\">0\"))/100","v":7.7267118875550151},{"$f":"100-(E199+F199+H199)","v":2.0827075789219123},{"$f":"IF((D201+H201)>100,H201*100/(D201+H201),H201)","v":0},{"$f":"IF((I201+M201)>100,I201*100/(I201+M201),I201)","v":100},{"$f":"I199*AVERAGEIF(J205:J216,\">0\")/100","v":91.652365951353403},{"$f":"I199*(100-AVERAGEIF(J205:J216,\">0\"))/100","v":8.3476340486465972},{"$f":"100-(J199+K199+M199)","v":0},{"$f":"IF((I201+M201)>100,M201*100/(I201+M201),M201)","v":0},{"$f":"IF((N201+R201)>100,N201*100/(N201+R201),N201)","v":100},{"$f":"N199*AVERAGEIF(O205:O216,\">0\")/100","v":95.686765106200909},{"$f":"N199*(100-AVERAGEIF(O205:O216,\">0\"))/100","v":4.3132348937990912},{"$f":"100-(O199+P199+R199)","v":0},{"$f":"IF((N201+R201)>100,R201*100/(N201+R201),R201)","v":0},{"$f":"IF((S201+W201)>100,S201*100/(S201+W201),S201)","v":100},{"$f":"S199*AVERAGEIF(T205:T216,\">0\")/100","v":95.486318010581783},{"$f":"S199*(100-AVERAGEIF(T205:T216,\">0\"))/100","v":4.5136819894182167},{"$f":"100-(T199+U199+W199)","v":0},{"$f":"IF((S201+W201)>100,W201*100/(S201+W201),W201)","v":0},{"$f":"IF((X201+AB201)>100,X201*100/(X201+AB201),X201)","v":100},{"$f":"X199*AVERAGEIF(Y205:Y216,\">0\")/100","v":96.408818523709002},{"$f":"X199*(100-AVERAGEIF(Y205:Y216,\">0\"))/100","v":3.5911814762909984},{"$f":"100-(Y199+Z199+AB199)","v":0},{"$f":"IF((X201+AB201)>100,AB201*100/(X201+AB201),AB201)","v":0}]
[null,null,{"$f":"MaxTarget(C205:C216)","v":2018},{"$f":"IF((D202+H202)>100,D202*100/(D202+H202),D202)","v":97.461374704187463},{"$f":"D200*AVERAGEIF(E205:E216,\">0\")/100","v":89.770639555324294},{"$f":"D200*(100-AVERAGEIF(E205:E216,\">0\"))/100","v":7.6907351488631717},{"$f":"100-(E200+F200+H200)","v":2.5386252958125368},{"$f":"IF((D202+H202)>100,H202*100/(D202+H202),H202)","v":0},{"$f":"IF((I202+M202)>100,I202*100/(I202+M202),I202)","v":99.203480180086984},{"$f":"I200*AVERAGEIF(J205:J216,\">0\")/100","v":90.922336691131662},{"$f":"I200*(100-AVERAGEIF(J205:J216,\">0\"))/100","v":8.281143488955319},{"$f":"100-(J200+K200+M200)","v":0.79651981991301568},{"$f":"IF((I202+M202)>100,M202*100/(I202+M202),M202)","v":0},{"$f":"IF((N202+R202)>100,N202*100/(N202+R202),N202)","v":100},{"$f":"N200*AVERAGEIF(O205:O216,\">0\")/100","v":95.686765106200909},{"$f":"N200*(100-AVERAGEIF(O205:O216,\">0\"))/100","v":4.3132348937990912},{"$f":"100-(O200+P200+R200)","v":0},{"$f":"IF((N202+R202)>100,R202*100/(N202+R202),R202)","v":0},{"$f":"IF((S202+W202)>100,S202*100/(S202+W202),S202)","v":100},{"$f":"S200*AVERAGEIF(T205:T216,\">0\")/100","v":95.486318010581783},{"$f":"S200*(100-AVERAGEIF(T205:T216,\">0\"))/100","v":4.5136819894182167},{"$f":"100-(T200+U200+W200)","v":0},{"$f":"IF((S202+W202)>100,W202*100/(S202+W202),W202)","v":0},{"$f":"IF((X202+AB202)>100,X202*100/(X202+AB202),X202)","v":100},{"$f":"X200*AVERAGEIF(Y205:Y216,\">0\")/100","v":96.408818523709002},{"$f":"X200*(100-AVERAGEIF(Y205:Y216,\">0\"))/100","v":3.5911814762909984},{"$f":"100-(Y200+Z200+AB200)","v":0},{"$f":"IF((X202+AB202)>100,AB202*100/(X202+AB202),AB202)","v":0}]
["Regression period:",null,{"$f":"MinRegYear(C199,C205:C216)","v":2003},{"$f":"IF(MAX(C205:C216)-MIN(C205:C216)<5,AVERAGEIF(C205:C216,\">0\",D205:D216),\nIF(FORECAST($C201,D$205:D$216,$C$205:$C$216)<0,0,\nIF(FORECAST($C201,D$205:D$216,$C$205:$C$216)>100,100,\nFORECAST($C201,D$205:D$216,$C$205:$C$216))))","v":97.917292421078102},null,null,null,{"$f":"IF(MAX(C205:C216)-MIN(C205:C216)<5,AVERAGEIF(C205:C216,\">0\",H205:H216),\nIF(FORECAST($C201,H$205:H$216,$C$205:$C$216)<0,0,\nIF(FORECAST($C201,H$205:H$216,$C$205:$C$216)>100,100,\nFORECAST($C201,H$205:H$216,$C$205:$C$216))))","v":0},{"$f":"IF(MAX(C205:C216)-MIN(C205:C216)<5,AVERAGEIF(C205:C216,\">0\",I205:I216),\nIF(FORECAST($C201,I$205:I$216,$C$205:$C$216)<0,0,\nIF(FORECAST($C201,I$205:I$216,$C$205:$C$216)>100,100,\nFORECAST($C201,I$205:I$216,$C$205:$C$216))))","v":100},null,null,null,{"$f":"IF(MAX(C205:C216)-MIN(C205:C216)<5,AVERAGEIF(C205:C216,\">0\",M205:M216),\nIF(FORECAST($C201,M$205:M$216,$C$205:$C$216)<0,0,\nIF(FORECAST($C201,M$205:M$216,$C$205:$C$216)>100,100,\nFORECAST($C201,M$205:M$216,$C$205:$C$216))))","v":0},{"$f":"IF(MAX(C205:C216)-MIN(C205:C216)<5,AVERAGEIF(C205:C216,\">0\",N205:N216),\nIF(FORECAST($C201,N$205:N$216,$C$205:$C$216)<0,0,\nIF(FORECAST($C201,N$205:N$216,$C$205:$C$216)>100,100,\nFORECAST($C201,N$205:N$216,$C$205:$C$216))))","v":100},null,null,null,{"$f":"IF(MAX(C205:C216)-MIN(C205:C216)<5,AVERAGEIF(C205:C216,\">0\",R205:R216),\nIF(FORECAST($C201,R$205:R$216,$C$205:$C$216)<0,0,\nIF(FORECAST($C201,R$205:R$216,$C$205:$C$216)>100,100,\nFORECAST($C201,R$205:R$216,$C$205:$C$216))))","v":0},{"$f":"IF(MAX(C205:C216)-MIN(C205:C216)<5,AVERAGEIF(C205:C216,\">0\",S205:S216),\nIF(FORECAST($C201,S$205:S$216,$C$205:$C$216)<0,0,\nIF(FORECAST($C201,S$205:S$216,$C$205:$C$216)>100,100,\nFORECAST($C201,S$205:S$216,$C$205:$C$216))))","v":100},null,null,null,{"$f":"IF(MAX(C205:C216)-MIN(C205:C216)<5,AVERAGEIF(C205:C216,\">0\",W205:W216),\nIF(FORECAST($C201,W$205:W$216,$C$205:$C$216)<0,0,\nIF(FORECAST($C201,W$205:W$216,$C$205:$C$216)>100,100,\nFORECAST($C201,W$205:W$216,$C$205:$C$216))))","v":0},{"$f":"IF(MAX(C205:C216)-MIN(C205:C216)<5,AVERAGEIF(C205:C216,\">0\",X205:X216),\nIF(FORECAST($C201,X$205:X$216,$C$205:$C$216)<0,0,\nIF(FORECAST($C201,X$205:X$216,$C$205:$C$216)>100,100,\nFORECAST($C201,X$205:X$216,$C$205:$C$216))))","v":100},null,null,null,{"$f":"IF(MAX(C205:C216)-MIN(C205:C216)<5,AVERAGEIF(C205:C216,\">0\",AB205:AB216),\nIF(FORECAST($C201,AB$205:AB$216,$C$205:$C$216)<0,0,\nIF(FORECAST($C201,AB$205:AB$216,$C$205:$C$216)>100,100,\nFORECAST($C201,AB$205:AB$216,$C$205:$C$216))))","v":0}]
[null,null,{"$f":"MaxRegYear(C200,C205:C216)","v":2014},{"$f":"IF(MAX(C205:C216)-MIN(C205:C216)<5,AVERAGEIF(C205:C216,\">0\",D205:D216),\nIF(FORECAST($C202,D$205:D$216,$C$205:$C$216)<0,0,\nIF(FORECAST($C202,D$205:D$216,$C$205:$C$216)>100,100,\nFORECAST($C202,D$205:D$216,$C$205:$C$216))))","v":97.461374704187463},null,null,null,{"$f":"IF(MAX(C205:C216)-MIN(C205:C216)<5,AVERAGEIF(C205:C216,\">0\",H205:H216),\nIF(FORECAST($C202,H$205:H$216,$C$205:$C$216)<0,0,\nIF(FORECAST($C202,H$205:H$216,$C$205:$C$216)>100,100,\nFORECAST($C202,H$205:H$216,$C$205:$C$216))))","v":0},{"$f":"IF(MAX(C205:C216)-MIN(C205:C216)<5,AVERAGEIF(C205:C216,\">0\",I205:I216),\nIF(FORECAST($C202,I$205:I$216,$C$205:$C$216)<0,0,\nIF(FORECAST($C202,I$205:I$216,$C$205:$C$216)>100,100,\nFORECAST($C202,I$205:I$216,$C$205:$C$216))))","v":99.203480180086984},null,null,null,{"$f":"IF(MAX(C205:C216)-MIN(C205:C216)<5,AVERAGEIF(C205:C216,\">0\",M205:M216),\nIF(FORECAST($C202,M$205:M$216,$C$205:$C$216)<0,0,\nIF(FORECAST($C202,M$205:M$216,$C$205:$C$216)>100,100,\nFORECAST($C202,M$205:M$216,$C$205:$C$216))))","v":0},{"$f":"IF(MAX(C205:C216)-MIN(C205:C216)<5,AVERAGEIF(C205:C216,\">0\",N205:N216),\nIF(FORECAST($C202,N$205:N$216,$C$205:$C$216)<0,0,\nIF(FORECAST($C202,N$205:N$216,$C$205:$C$216)>100,100,\nFORECAST($C202,N$205:N$216,$C$205:$C$216))))","v":100},null,null,null,{"$f":"IF(MAX(C205:C216)-MIN(C205:C216)<5,AVERAGEIF(C205:C216,\">0\",R205:R216),\nIF(FORECAST($C202,R$205:R$216,$C$205:$C$216)<0,0,\nIF(FORECAST($C202,R$205:R$216,$C$205:$C$216)>100,100,\nFORECAST($C202,R$205:R$216,$C$205:$C$216))))","v":0},{"$f":"IF(MAX(C205:C216)-MIN(C205:C216)<5,AVERAGEIF(C205:C216,\">0\",S205:S216),\nIF(FORECAST($C202,S$205:S$216,$C$205:$C$216)<0,0,\nIF(FORECAST($C202,S$205:S$216,$C$205:$C$216)>100,100,\nFORECAST($C202,S$205:S$216,$C$205:$C$216))))","v":100},null,null,null,{"$f":"IF(MAX(C205:C216)-MIN(C205:C216)<5,AVERAGEIF(C205:C216,\">0\",W205:W216),\nIF(FORECAST($C202,W$205:W$216,$C$205:$C$216)<0,0,\nIF(FORECAST($C202,W$205:W$216,$C$205:$C$216)>100,100,\nFORECAST($C202,W$205:W$216,$C$205:$C$216))))","v":0},{"$f":"IF(MAX(C205:C216)-MIN(C205:C216)<5,AVERAGEIF(C205:C216,\">0\",X205:X216),\nIF(FORECAST($C202,X$205:X$216,$C$205:$C$216)<0,0,\nIF(FORECAST($C202,X$205:X$216,$C$205:$C$216)>100,100,\nFORECAST($C202,X$205:X$216,$C$205:$C$216))))","v":100},null,null,null,{"$f":"IF(MAX(C205:C216)-MIN(C205:C216)<5,AVERAGEIF(C205:C216,\">0\",AB205:AB216),\nIF(FORECAST($C202,AB$205:AB$216,$C$205:$C$216)<0,0,\nIF(FORECAST($C202,AB$205:AB$216,$C$205:$C$216)>100,100,\nFORECAST($C202,AB$205:AB$216,$C$205:$C$216))))","v":0}]
[]
[null,"Survey","Year","Improved","Not shared",null,null,"Open defecation","Improved","Not shared",null,null,"Open defecation","Improved","Not shared",null,null,"Open defecation","Improved","Not shared",null,null,"Open defecation","Improved","Not shared",null,null,"Open defecation"]
[null,"MICS05",2005,{"$f":"IF(ISERROR(INDIRECT(CONCATENATE($B205,\"!H122\"))),\"\",INDIRECT(CONCATENATE($B205,\"!H122\")))","v":97.834398290734342},{"$f":"IF(ISERROR(INDIRECT(CONCATENATE($B205,\"!H129\"))),\"\",INDIRECT(CONCATENATE($B205,\"!H129\")))","v":89.640422470849529},null,null,{"$f":"IF(ISERROR(INDIRECT(CONCATENATE($B205,\"!H127\"))),\"\",INDIRECT(CONCATENATE($B205,\"!H127\")))","v":0},{"$f":"IF(ISERROR(INDIRECT(CONCATENATE($B205,\"!I122\"))),\"\",INDIRECT(CONCATENATE($B205,\"!I122\")))","v":99.874499663141961},{"$f":"IF(ISERROR(INDIRECT(CONCATENATE($B205,\"!I129\"))),\"\",INDIRECT(CONCATENATE($B205,\"!I129\")))","v":87.791842822845652},null,null,{"$f":"IF(ISERROR(INDIRECT(CONCATENATE($B205,\"!I127\"))),\"\",INDIRECT(CONCATENATE($B205,\"!I127\")))","v":0},{"$f":"IF(ISERROR(INDIRECT(CONCATENATE($B205,\"!J122\"))),\"\",INDIRECT(CONCATENATE($B205,\"!J122\")))","v":100},{"$f":"IF(ISERROR(INDIRECT(CONCATENATE($B205,\"!J129\"))),\"\",INDIRECT(CONCATENATE($B205,\"!J129\")))","v":94.390082533445536},null,null,{"$f":"IF(ISERROR(INDIRECT(CONCATENATE($B205,\"!J127\"))),\"\",INDIRECT(CONCATENATE($B205,\"!J127\")))","v":0},{"$f":"IF(ISERROR(INDIRECT(CONCATENATE($B205,\"!K122\"))),\"\",INDIRECT(CONCATENATE($B205,\"!K122\")))","v":100},{"$f":"IF(ISERROR(INDIRECT(CONCATENATE($B205,\"!K129\"))),\"\",INDIRECT(CONCATENATE($B205,\"!K129\")))","v":92.621106072560522},null,null,{"$f":"IF(ISERROR(INDIRECT(CONCATENATE($B205,\"!K127\"))),\"\",INDIRECT(CONCATENATE($B205,\"!K127\")))","v":0},{"$f":"IF(ISERROR(INDIRECT(CONCATENATE($B205,\"!L122\"))),\"\",INDIRECT(CONCATENATE($B205,\"!L122\")))","v":100},{"$f":"IF(ISERROR(INDIRECT(CONCATENATE($B205,\"!L129\"))),\"\",INDIRECT(CONCATENATE($B205,\"!L129\")))","v":93.702600325432613},null,null,{"$f":"IF(ISERROR(INDIRECT(CONCATENATE($B205,\"!L2127\"))),\"\",INDIRECT(CONCATENATE($B205,\"!L127\")))","v":0}]
[null,"MICS12",2012,97.544268834531209,94.577458362032402,null,null,0,99.352595620765868,95.512889079861139,null,null,0,100,96.983447678956267,null,null,0,100,98.351529948603044,null,null,0,100,99.11503672198539,null,null,0]
[null,null,null,"","",null,null,"","","",null,null,"","","",null,null,"","","",null,null,"","","",null,null,""]
[null,null,null,"","",null,null,"","","",null,null,"","","",null,null,"","","",null,null,"","","",null,null,""]
[null,null,null,"","",null,null,"","","",null,null,"","","",null,null,"","","",null,null,"","","",null,null,""]
[null,null,null,"","",null,null,"","","",null,null,"","","",null,null,"","","",null,null,"","","",null,null,""]
[null,null,null,"","",null,null,"","","",null,null,"","","",null,null,"","","",null,null,"","","",null,null,""]
[null,null,null,"","",null,null,"","","",null,null,"","","",null,null,"","","",null,null,"","","",null,null,""]
[null,null,null,"","",null,null,"","","",null,null,"","","",null,null,"","","",null,null,"","","",null,null,""]
[null,null,null,"","",null,null,"","","",null,null,"","","",null,null,"","","",null,null,"","","",null,null,""]
[null,null,null,"","",null,null,"","","",null,null,"","","",null,null,"","","",null,null,"","","",null,null,""]
[null,null,null,"","",null,null,"","","",null,null,"","","",null,null,"","","",null,null,"","","",null,null,""]
[]
[null,{"$f":"CONCATENATE(\"Urban use of sanitation facilities, \",C199,\"–\",C200)","v":"Urban use of sanitation facilities, 2000–2018"},null,null,null,null,null,null,null,null,null,null,null,null,null,null,null,null,"Data points used for regression"]
[]
[]
[]
[]
[]
[]
[]
[]
[]
[]
[]
[]
[]
[]
[]
[]
[]
[]
[]
[]
[]
[]
[]
[]
[]
[]
[]
[]
[]
[]
[]
[]
[]
[]
[]
[]
[]
[]
[]
[]
[]
[]
[]
[]
[]
[]
[]
[]
[]
[]
[]
[]
[]
[]
[]
[]
[]
[]
[]
[]
[]
[]
[]
[]
[]
[]
[]
[]
[]
[]
[]
[]
[]
[]
[]
[]
[]
[]
["RURAL",null,null,"Poorest",null,null,null,null,"Poor",null,null,null,null,"Middle",null,null,null,null,"Rich",null,null,null,null,"Richest"]
[null,null,null,"Improved","Basic","Limited","Unimproved","Open defecation","Improved","Basic","Limited","Unimproved","Open defecation","Improved","Basic","Limited","Unimproved","Open defecation","Improved","Basic","Limited","Unimproved","Open defecation","Improved","Basic","Limited","Unimproved","Open defecation"]
["Forecast period:",null,{"$f":"MinBase(C305:C316)","v":2000},{"$f":"IF((D301+H301)>100,D301*100/(D301+H301),D301)","v":100},{"$f":"D299*AVERAGEIF(E305:E316,\">0\")/100","v":97.694950551358176},{"$f":"D299*(100-AVERAGEIF(E305:E316,\">0\"))/100","v":2.3050494486418245},{"$f":"100-(E299+F299+H299)","v":0},{"$f":"IF((D301+H301)>100,H301*100/(D301+H301),H301)","v":0},{"$f":"IF((I301+M301)>100,I301*100/(I301+M301),I301)","v":99.038087996862942},{"$f":"I299*AVERAGEIF(J305:J316,\">0\")/100","v":96.135331213248051},{"$f":"I299*(100-AVERAGEIF(J305:J316,\">0\"))/100","v":2.9027567836148958},{"$f":"100-(J299+K299+M299)","v":0.96191200313705849},{"$f":"IF((I301+M301)>100,M301*100/(I301+M301),M301)","v":0},{"$f":"IF((N301+R301)>100,N301*100/(N301+R301),N301)","v":100},{"$f":"N299*AVERAGEIF(O305:O316,\">0\")/100","v":97.489870259189587},{"$f":"N299*(100-AVERAGEIF(O305:O316,\">0\"))/100","v":2.5101297408104131},{"$f":"100-(O299+P299+R299)","v":0},{"$f":"IF((N301+R301)>100,R301*100/(N301+R301),R301)","v":0},{"$f":"IF((S301+W301)>100,S301*100/(S301+W301),S301)","v":99.187497427556934},{"$f":"S299*AVERAGEIF(T305:T316,\">0\")/100","v":96.882100140420334},{"$f":"S299*(100-AVERAGEIF(T305:T316,\">0\"))/100","v":2.3053972871365951},{"$f":"100-(T299+U299+W299)","v":0.81250257244306567},{"$f":"IF((S301+W301)>100,W301*100/(S301+W301),W301)","v":0},{"$f":"IF((X301+AB301)>100,X301*100/(X301+AB301),X301)","v":99.623862626167593},{"$f":"X299*AVERAGEIF(Y305:Y316,\">0\")/100","v":98.859555334543401},{"$f":"X299*(100-AVERAGEIF(Y305:Y316,\">0\"))/100","v":0.7643072916241952},{"$f":"100-(Y299+Z299+AB299)","v":0.37613737383240675},{"$f":"IF((X301+AB301)>100,AB301*100/(X301+AB301),AB301)","v":0}]
[null,null,{"$f":"MaxTarget(C305:C316)","v":2018},{"$f":"IF((D302+H302)>100,D302*100/(D302+H302),D302)","v":89.76738237963832},{"$f":"D300*AVERAGEIF(E305:E316,\">0\")/100","v":87.698199827036262},{"$f":"D300*(100-AVERAGEIF(E305:E316,\">0\"))/100","v":2.0691825526020513},{"$f":"100-(E300+F300+H300)","v":10.23261762036168},{"$f":"IF((D302+H302)>100,H302*100/(D302+H302),H302)","v":0},{"$f":"IF((I302+M302)>100,I302*100/(I302+M302),I302)","v":93.259148069812909},{"$f":"I300*AVERAGEIF(J305:J316,\">0\")/100","v":90.525769122691358},{"$f":"I300*(100-AVERAGEIF(J305:J316,\">0\"))/100","v":2.7333789471215382},{"$f":"100-(J300+K300+M300)","v":6.7408519301871053},{"$f":"IF((I302+M302)>100,M302*100/(I302+M302),M302)","v":0},{"$f":"IF((N302+R302)>100,N302*100/(N302+R302),N302)","v":94.748405427600801},{"$f":"N300*AVERAGEIF(O305:O316,\">0\")/100","v":92.370097524018959},{"$f":"N300*(100-AVERAGEIF(O305:O316,\">0\"))/100","v":2.3783079035818351},{"$f":"100-(O300+P300+R300)","v":5.251594572399199},{"$f":"IF((N302+R302)>100,R302*100/(N302+R302),R302)","v":0},{"$f":"IF((S302+W302)>100,S302*100/(S302+W302),S302)","v":97.578635323930598},{"$f":"S300*AVERAGEIF(T305:T316,\">0\")/100","v":95.31063253131471},{"$f":"S300*(100-AVERAGEIF(T305:T316,\">0\"))/100","v":2.2680027926158921},{"$f":"100-(T300+U300+W300)","v":2.4213646760694019},{"$f":"IF((S302+W302)>100,W302*100/(S302+W302),W302)","v":0},{"$f":"IF((X302+AB302)>100,X302*100/(X302+AB302),X302)","v":99.821009188320147},{"$f":"X300*AVERAGEIF(Y305:Y316,\">0\")/100","v":99.055189402088743},{"$f":"X300*(100-AVERAGEIF(Y305:Y316,\">0\"))/100","v":0.76581978623140856},{"$f":"100-(Y300+Z300+AB300)","v":0.17899081167985287},{"$f":"IF((X302+AB302)>100,AB302*100/(X302+AB302),AB302)","v":0}]
["Regression period:",null,{"$f":"MinRegYear(C299,C305:C316)","v":2003},{"$f":"IF(MAX(C305:C316)-MIN(C305:C316)<5,AVERAGEIF(C305:C316,\">0\",D305:D316),\nIF(FORECAST($C301,D$305:D$316,$C$305:$C$316)<0,0,\nIF(FORECAST($C301,D$305:D$316,$C$305:$C$316)>100,100,\nFORECAST($C301,D$305:D$316,$C$305:$C$316))))","v":100},null,null,null,{"$f":"IF(MAX(C305:C316)-MIN(C305:C316)<5,AVERAGEIF(C305:C316,\">0\",H305:H316),\nIF(FORECAST($C301,H$305:H$316,$C$305:$C$316)<0,0,\nIF(FORECAST($C301,H$305:H$316,$C$305:$C$316)>100,100,\nFORECAST($C301,H$305:H$316,$C$305:$C$316))))","v":0},{"$f":"IF(MAX(C305:C316)-MIN(C305:C316)<5,AVERAGEIF(C305:C316,\">0\",I305:I316),\nIF(FORECAST($C301,I$305:I$316,$C$305:$C$316)<0,0,\nIF(FORECAST($C301,I$305:I$316,$C$305:$C$316)>100,100,\nFORECAST($C301,I$305:I$316,$C$305:$C$316))))","v":99.038087996862942},null,null,null,{"$f":"IF(MAX(C305:C316)-MIN(C305:C316)<5,AVERAGEIF(C305:C316,\">0\",M305:M316),\nIF(FORECAST($C301,M$305:M$316,$C$305:$C$316)<0,0,\nIF(FORECAST($C301,M$305:M$316,$C$305:$C$316)>100,100,\nFORECAST($C301,M$305:M$316,$C$305:$C$316))))","v":0},{"$f":"IF(MAX(C305:C316)-MIN(C305:C316)<5,AVERAGEIF(C305:C316,\">0\",N305:N316),\nIF(FORECAST($C301,N$305:N$316,$C$305:$C$316)<0,0,\nIF(FORECAST($C301,N$305:N$316,$C$305:$C$316)>100,100,\nFORECAST($C301,N$305:N$316,$C$305:$C$316))))","v":100},null,null,null,{"$f":"IF(MAX(C305:C316)-MIN(C305:C316)<5,AVERAGEIF(C305:C316,\">0\",R305:R316),\nIF(FORECAST($C301,R$305:R$316,$C$305:$C$316)<0,0,\nIF(FORECAST($C301,R$305:R$316,$C$305:$C$316)>100,100,\nFORECAST($C301,R$305:R$316,$C$305:$C$316))))","v":0},{"$f":"IF(MAX(C305:C316)-MIN(C305:C316)<5,AVERAGEIF(C305:C316,\">0\",S305:S316),\nIF(FORECAST($C301,S$305:S$316,$C$305:$C$316)<0,0,\nIF(FORECAST($C301,S$305:S$316,$C$305:$C$316)>100,100,\nFORECAST($C301,S$305:S$316,$C$305:$C$316))))","v":99.187497427556934},null,null,null,{"$f":"IF(MAX(C305:C316)-MIN(C305:C316)<5,AVERAGEIF(C305:C316,\">0\",W305:W316),\nIF(FORECAST($C301,W$305:W$316,$C$305:$C$316)<0,0,\nIF(FORECAST($C301,W$305:W$316,$C$305:$C$316)>100,100,\nFORECAST($C301,W$305:W$316,$C$305:$C$316))))","v":0},{"$f":"IF(MAX(C305:C316)-MIN(C305:C316)<5,AVERAGEIF(C305:C316,\">0\",X305:X316),\nIF(FORECAST($C301,X$305:X$316,$C$305:$C$316)<0,0,\nIF(FORECAST($C301,X$305:X$316,$C$305:$C$316)>100,100,\nFORECAST($C301,X$305:X$316,$C$305:$C$316))))","v":99.623862626167593},null,null,null,{"$f":"IF(MAX(C305:C316)-MIN(C305:C316)<5,AVERAGEIF(C305:C316,\">0\",AB305:AB316),\nIF(FORECAST($C301,AB$305:AB$316,$C$305:$C$316)<0,0,\nIF(FORECAST($C301,AB$305:AB$316,$C$305:$C$316)>100,100,\nFORECAST($C301,AB$305:AB$316,$C$305:$C$316))))","v":0}]
[null,null,{"$f":"MaxRegYear(C300,C305:C316)","v":2014},{"$f":"IF(MAX(C305:C316)-MIN(C305:C316)<5,AVERAGEIF(C305:C316,\">0\",D305:D316),\nIF(FORECAST($C302,D$305:D$316,$C$305:$C$316)<0,0,\nIF(FORECAST($C302,D$305:D$316,$C$305:$C$316)>100,100,\nFORECAST($C302,D$305:D$316,$C$305:$C$316))))","v":89.76738237963832},null,null,null,{"$f":"IF(MAX(C305:C316)-MIN(C305:C316)<5,AVERAGEIF(C305:C316,\">0\",H305:H316),\nIF(FORECAST($C302,H$305:H$316,$C$305:$C$316)<0,0,\nIF(FORECAST($C302,H$305:H$316,$C$305:$C$316)>100,100,\nFORECAST($C302,H$305:H$316,$C$305:$C$316))))","v":0},{"$f":"IF(MAX(C305:C316)-MIN(C305:C316)<5,AVERAGEIF(C305:C316,\">0\",I305:I316),\nIF(FORECAST($C302,I$305:I$316,$C$305:$C$316)<0,0,\nIF(FORECAST($C302,I$305:I$316,$C$305:$C$316)>100,100,\nFORECAST($C302,I$305:I$316,$C$305:$C$316))))","v":93.259148069812909},null,null,null,{"$f":"IF(MAX(C305:C316)-MIN(C305:C316)<5,AVERAGEIF(C305:C316,\">0\",M305:M316),\nIF(FORECAST($C302,M$305:M$316,$C$305:$C$316)<0,0,\nIF(FORECAST($C302,M$305:M$316,$C$305:$C$316)>100,100,\nFORECAST($C302,M$305:M$316,$C$305:$C$316))))","v":0},{"$f":"IF(MAX(C305:C316)-MIN(C305:C316)<5,AVERAGEIF(C305:C316,\">0\",N305:N316),\nIF(FORECAST($C302,N$305:N$316,$C$305:$C$316)<0,0,\nIF(FORECAST($C302,N$305:N$316,$C$305:$C$316)>100,100,\nFORECAST($C302,N$305:N$316,$C$305:$C$316))))","v":94.748405427600801},null,null,null,{"$f":"IF(MAX(C305:C316)-MIN(C305:C316)<5,AVERAGEIF(C305:C316,\">0\",R305:R316),\nIF(FORECAST($C302,R$305:R$316,$C$305:$C$316)<0,0,\nIF(FORECAST($C302,R$305:R$316,$C$305:$C$316)>100,100,\nFORECAST($C302,R$305:R$316,$C$305:$C$316))))","v":0},{"$f":"IF(MAX(C305:C316)-MIN(C305:C316)<5,AVERAGEIF(C305:C316,\">0\",S305:S316),\nIF(FORECAST($C302,S$305:S$316,$C$305:$C$316)<0,0,\nIF(FORECAST($C302,S$305:S$316,$C$305:$C$316)>100,100,\nFORECAST($C302,S$305:S$316,$C$305:$C$316))))","v":97.578635323930598},null,null,null,{"$f":"IF(MAX(C305:C316)-MIN(C305:C316)<5,AVERAGEIF(C305:C316,\">0\",W305:W316),\nIF(FORECAST($C302,W$305:W$316,$C$305:$C$316)<0,0,\nIF(FORECAST($C302,W$305:W$316,$C$305:$C$316)>100,100,\nFORECAST($C302,W$305:W$316,$C$305:$C$316))))","v":0},{"$f":"IF(MAX(C305:C316)-MIN(C305:C316)<5,AVERAGEIF(C305:C316,\">0\",X305:X316),\nIF(FORECAST($C302,X$305:X$316,$C$305:$C$316)<0,0,\nIF(FORECAST($C302,X$305:X$316,$C$305:$C$316)>100,100,\nFORECAST($C302,X$305:X$316,$C$305:$C$316))))","v":99.821009188320147},null,null,null,{"$f":"IF(MAX(C305:C316)-MIN(C305:C316)<5,AVERAGEIF(C305:C316,\">0\",AB305:AB316),\nIF(FORECAST($C302,AB$305:AB$316,$C$305:$C$316)<0,0,\nIF(FORECAST($C302,AB$305:AB$316,$C$305:$C$316)>100,100,\nFORECAST($C302,AB$305:AB$316,$C$305:$C$316))))","v":0}]
[]
[null,"Survey","Year","Improved","Not shared",null,null,"Open defecation","Improved","Not shared",null,null,"Open defecation","Improved","Not shared",null,null,"Open defecation","Improved","Not shared",null,null,"Open defecation","Improved","Not shared",null,null,"Open defecation"]
[null,"MICS05",2005,{"$f":"IF(ISERROR(INDIRECT(CONCATENATE($B305,\"!M122\"))),\"\",INDIRECT(CONCATENATE($B305,\"!M122\")))","v":98.512848825766426},{"$f":"IF(ISERROR(INDIRECT(CONCATENATE($B305,\"!M129\"))),\"\",INDIRECT(CONCATENATE($B305,\"!M129\")))","v":98.33316539633293},null,null,{"$f":"IF(ISERROR(INDIRECT(CONCATENATE($B305,\"!M127\"))),\"\",INDIRECT(CONCATENATE($B305,\"!M127\")))","v":0},{"$f":"IF(ISERROR(INDIRECT(CONCATENATE($B305,\"!N122\"))),\"\",INDIRECT(CONCATENATE($B305,\"!N122\")))","v":97.987371646490146},{"$f":"IF(ISERROR(INDIRECT(CONCATENATE($B305,\"!N129\"))),\"\",INDIRECT(CONCATENATE($B305,\"!N129\")))","v":96.260948019670025},null,null,{"$f":"IF(ISERROR(INDIRECT(CONCATENATE($B305,\"!N127\"))),\"\",INDIRECT(CONCATENATE($B305,\"!N127\")))","v":0},{"$f":"IF(ISERROR(INDIRECT(CONCATENATE($B305,\"!O122\"))),\"\",INDIRECT(CONCATENATE($B305,\"!O122\")))","v":99.653335793366409},{"$f":"IF(ISERROR(INDIRECT(CONCATENATE($B305,\"!O129\"))),\"\",INDIRECT(CONCATENATE($B305,\"!O129\")))","v":97.083042410972936},null,null,{"$f":"IF(ISERROR(INDIRECT(CONCATENATE($B305,\"!O127\"))),\"\",INDIRECT(CONCATENATE($B305,\"!O127\")))","v":0},{"$f":"IF(ISERROR(INDIRECT(CONCATENATE($B305,\"!P122\"))),\"\",INDIRECT(CONCATENATE($B305,\"!P122\")))","v":98.894977045079415},{"$f":"IF(ISERROR(INDIRECT(CONCATENATE($B305,\"!P129\"))),\"\",INDIRECT(CONCATENATE($B305,\"!P129\")))","v":97.223175559991915},null,null,{"$f":"IF(ISERROR(INDIRECT(CONCATENATE($B305,\"!P127\"))),\"\",INDIRECT(CONCATENATE($B305,\"!P127\")))","v":0},{"$f":"IF(ISERROR(INDIRECT(CONCATENATE($B305,\"!Q122\"))),\"\",INDIRECT(CONCATENATE($B305,\"!Q122\")))","v":99.659707455649865},{"$f":"IF(ISERROR(INDIRECT(CONCATENATE($B305,\"!Q129\"))),\"\",INDIRECT(CONCATENATE($B305,\"!Q129\")))","v":98.891443793018183},null,null,{"$f":"IF(ISERROR(INDIRECT(CONCATENATE($B305,\"!Q2127\"))),\"\",INDIRECT(CONCATENATE($B305,\"!Q127\")))","v":0}]
[null,"MICS12",2012,91.710819367666844,97.056735706383407,null,null,0,94.309864420185562,97.877152094486377,null,null,0,95.838389953326541,97.896698107406237,null,null,0,97.871155706408132,98.128260161389449,null,null,0,99.785164358837847,99.574170224594809,null,null,0]
[null,null,null,"","",null,null,"","","",null,null,"","","",null,null,"","","",null,null,"","","",null,null,""]
[null,null,null,"","",null,null,"","","",null,null,"","","",null,null,"","","",null,null,"","","",null,null,""]
[null,null,null,"","",null,null,"","","",null,null,"","","",null,null,"","","",null,null,"","","",null,null,""]
[null,null,null,"","",null,null,"","","",null,null,"","","",null,null,"","","",null,null,"","","",null,null,""]
[null,null,null,"","",null,null,"","","",null,null,"","","",null,null,"","","",null,null,"","","",null,null,""]
[null,null,null,"","",null,null,"","","",null,null,"","","",null,null,"","","",null,null,"","","",null,null,""]
[null,null,null,"","",null,null,"","","",null,null,"","","",null,null,"","","",null,null,"","","",null,null,""]
[null,null,null,"","",null,null,"","","",null,null,"","","",null,null,"","","",null,null,"","","",null,null,""]
[null,null,null,"","",null,null,"","","",null,null,"","","",null,null,"","","",null,null,"","","",null,null,""]
[null,null,null,"","",null,null,"","","",null,null,"","","",null,null,"","","",null,null,"","","",null,null,""]
[]
[null,{"$f":"CONCATENATE(\"Rural use of sanitation facilities, \",C299,\"–\",C300)","v":"Rural use of sanitation facilities, 2000–2018"},null,null,null,null,null,null,null,null,null,null,null,null,null,null,null,null,"Data points used for regression"]

{"sheet":"Hygiene","index":3,"n_rows":90,"n_cols":25,"rows_kept":90,"cut":false,"hidden":false,"merged":[[39,22,40,22],[39,23,40,23],[39,24,40,24],[31,4,32,5],[39,16,40,16],[39,17,40,17],[39,18,40,18],[39,19,40,19],[39,20,40,20],[39,21,40,21],[36,24,37,24],[39,6,40,7],[39,8,40,8],[39,9,40,9],[39,10,40,10],[39,11,40,11],[39,12,40,12],[39,13,40,13],[39,14,40,14],[39,15,40,15],[36,18,37,18],[36,12,37,12],[36,13,37,13],[36,14,37,14],[36,15,37,15],[36,16,37,16],[36,17,37,17],[36,19,37,19],[36,20,37,20],[36,21,37,21],[36,22,37,22],[36,23,37,23],[33,20,34,20],[33,21,34,21],[33,22,34,22],[33,23,34,23],[33,24,34,24],[33,15,34,15],[33,16,34,16],[33,17,34,17],[33,18,34,18],[36,6,37,7],[36,8,37,8],[36,9,37,9],[36,10,37,10],[36,11,37,11],[33,10,34,10],[33,11,34,11],[33,12,34,12],[33,13,34,13],[33,14,34,14],[6,1,6,7],[3,1,3,24],[4,1,4,24],[33,1,34,3],[31,6,32,9],[31,10,31,12],[31,13,31,15],[6,10,6,15],[6,18,6,23],[33,19,34,19],[31,16,31,18],[31,19,31,21],[31,22,31,24],[33,6,34,7],[33,8,34,8],[33,9,34,9]]}
[]
[]
[]
[null,"Access to hygiene facilities by wealth quintile (%)"]
[null,{"$f":"IF(ISERROR(INDIRECT(CONCATENATE($E$32,\"!A2\"))),\"\",INDIRECT(CONCATENATE($E$32,\"!A2\")))","v":"Belarus"}]
[]
[null,{"$f":"CONCATENATE(\"National \",IF(ISERROR(INDIRECT(CONCATENATE($E$32,\"!A2\"))),\"\",INDIRECT(CONCATENATE($E$32,\"!A210\"))))","v":"National Access to hygiene facilities "},null,null,null,null,null,null,null,null,{"$f":"CONCATENATE(\"Urban \",IF(ISERROR(INDIRECT(CONCATENATE($E$32,\"!A2\"))),\"\",INDIRECT(CONCATENATE($E$32,\"!A210\"))))","v":"Urban Access to hygiene facilities "},null,null,null,null,null,null,null,{"$f":"CONCATENATE(\"Rural \",IF(ISERROR(INDIRECT(CONCATENATE($E$32,\"!A2\"))),\"\",INDIRECT(CONCATENATE($E$32,\"!A210\"))))","v":"Rural Access to hygiene facilities "}]
[]
[]
[]
[]
[]
[]
[]
[]
[]
[]
[]
[]
[]
[]
[]
[]
[]
[]
[]
[]
[]
[]
[]
[]
[null,null,null,null,{"$f":"INDEX(B88:B100,A88)","v":"MICS12"},null,{"$f":"IF(ISERROR(INDIRECT(CONCATENATE($E$32,\"!A2\"))),\"\",INDIRECT(CONCATENATE($E$32,\"!A2\")))","v":"Belarus"},null,null,null,"Poorest",null,null,"Poor",null,null,"Middle",null,null,"Rich",null,null,"Richest"]
[null,null,null,null,null,null,null,null,null,null,"Basic","Limited","No facility","Basic","Limited","No facility","Basic","Limited","No facility","Basic","Limited","No facility","Basic","Limited","No facility"]
[null,">>>  Select Survey :   ",null,null,null,null,"NATIONAL",null,null,{"$f":"IF(ISERROR(INDIRECT(CONCATENATE(#REF!,\"!A2\"))),\"\",INDIRECT(CONCATENATE(#REF!,\"!A210\")))","v":""},{"$f":"IF(ISERROR(INDIRECT(CONCATENATE($E$32,\"!C222\"))),\"\",INDIRECT(CONCATENATE($E$32,\"!C222\")))","v":"N/A"},{"$f":"IF(ISERROR(INDIRECT(CONCATENATE($E$32,\"!C223\"))),\"\",INDIRECT(CONCATENATE($E$32,\"!C223\")))","v":"N/A"},{"$f":"IF(ISERROR(INDIRECT(CONCATENATE($E$32,\"!C224\"))),\"\",INDIRECT(CONCATENATE($E$32,\"!C224\")))","v":"N/A"},{"$f":"IF(ISERROR(INDIRECT(CONCATENATE($E$32,\"!D222\"))),\"\",INDIRECT(CONCATENATE($E$32,\"!D222\")))","v":"N/A"},{"$f":"IF(ISERROR(INDIRECT(CONCATENATE($E$32,\"!D223\"))),\"\",INDIRECT(CONCATENATE($E$32,\"!D223\")))","v":"N/A"},{"$f":"IF(ISERROR(INDIRECT(CONCATENATE($E$32,\"!D224\"))),\"\",INDIRECT(CONCATENATE($E$32,\"!D224\")))","v":"N/A"},{"$f":"IF(ISERROR(INDIRECT(CONCATENATE($E$32,\"!E222\"))),\"\",INDIRECT(CONCATENATE($E$32,\"!E222\")))","v":"N/A"},{"$f":"IF(ISERROR(INDIRECT(CONCATENATE($E$32,\"!E223\"))),\"\",INDIRECT(CONCATENATE($E$32,\"!E223\")))","v":"N/A"},{"$f":"IF(ISERROR(INDIRECT(CONCATENATE($E$32,\"!E224\"))),\"\",INDIRECT(CONCATENATE($E$32,\"!E224\")))","v":"N/A"},{"$f":"IF(ISERROR(INDIRECT(CONCATENATE($E$32,\"!F222\"))),\"\",INDIRECT(CONCATENATE($E$32,\"!F222\")))","v":"N/A"},{"$f":"IF(ISERROR(INDIRECT(CONCATENATE($E$32,\"!F223\"))),\"\",INDIRECT(CONCATENATE($E$32,\"!F223\")))","v":"N/A"},{"$f":"IF(ISERROR(INDIRECT(CONCATENATE($E$32,\"!F224\"))),\"\",INDIRECT(CONCATENATE($E$32,\"!F224\")))","v":"N/A"},{"$f":"IF(ISERROR(INDIRECT(CONCATENATE($E$32,\"!G222\"))),\"\",INDIRECT(CONCATENATE($E$32,\"!G222\")))","v":"N/A"},{"$f":"IF(ISERROR(INDIRECT(CONCATENATE($E$32,\"!G223\"))),\"\",INDIRECT(CONCATENATE($E$32,\"!G223\")))","v":"N/A"},{"$f":"IF(ISERROR(INDIRECT(CONCATENATE($E$32,\"!G224\"))),\"\",INDIRECT(CONCATENATE($E$32,\"!G224\")))","v":"N/A"}]
[]
[]
[null,null,null,null,null,null,"URBAN",null,null,{"$f":"IF(ISERROR(INDIRECT(CONCATENATE(#REF!,\"!A2\"))),\"\",INDIRECT(CONCATENATE(#REF!,\"!A210\")))","v":""},{"$f":"IF(ISERROR(INDIRECT(CONCATENATE($E$32,\"!H222\"))),\"\",INDIRECT(CONCATENATE($E$32,\"!H222\")))","v":"N/A"},{"$f":"IF(ISERROR(INDIRECT(CONCATENATE($E$32,\"!H223\"))),\"\",INDIRECT(CONCATENATE($E$32,\"!H223\")))","v":"N/A"},{"$f":"IF(ISERROR(INDIRECT(CONCATENATE($E$32,\"!H224\"))),\"\",INDIRECT(CONCATENATE($E$32,\"!H224\")))","v":"N/A"},{"$f":"IF(ISERROR(INDIRECT(CONCATENATE($E$32,\"!I222\"))),\"\",INDIRECT(CONCATENATE($E$32,\"!I222\")))","v":"N/A"},{"$f":"IF(ISERROR(INDIRECT(CONCATENATE($E$32,\"!I223\"))),\"\",INDIRECT(CONCATENATE($E$32,\"!I223\")))","v":"N/A"},{"$f":"IF(ISERROR(INDIRECT(CONCATENATE($E$32,\"!I224\"))),\"\",INDIRECT(CONCATENATE($E$32,\"!I224\")))","v":"N/A"},{"$f":"IF(ISERROR(INDIRECT(CONCATENATE($E$32,\"!J222\"))),\"\",INDIRECT(CONCATENATE($E$32,\"!J222\")))","v":"N/A"},{"$f":"IF(ISERROR(INDIRECT(CONCATENATE($E$32,\"!J223\"))),\"\",INDIRECT(CONCATENATE($E$32,\"!J223\")))","v":"N/A"},{"$f":"IF(ISERROR(INDIRECT(CONCATENATE($E$32,\"!J224\"))),\"\",INDIRECT(CONCATENATE($E$32,\"!J224\")))","v":"N/A"},{"$f":"IF(ISERROR(INDIRECT(CONCATENATE($E$32,\"!K222\"))),\"\",INDIRECT(CONCATENATE($E$32,\"!K222\")))","v":"N/A"},{"$f":"IF(ISERROR(INDIRECT(CONCATENATE($E$32,\"!K223\"))),\"\",INDIRECT(CONCATENATE($E$32,\"!K223\")))","v":"N/A"},{"$f":"IF(ISERROR(INDIRECT(CONCATENATE($E$32,\"!K224\"))),\"\",INDIRECT(CONCATENATE($E$32,\"!K224\")))","v":"N/A"},{"$f":"IF(ISERROR(INDIRECT(CONCATENATE($E$32,\"!L222\"))),\"\",INDIRECT(CONCATENATE($E$32,\"!L222\")))","v":"N/A"},{"$f":"IF(ISERROR(INDIRECT(CONCATENATE($E$32,\"!L223\"))),\"\",INDIRECT(CONCATENATE($E$32,\"!L223\")))","v":"N/A"},{"$f":"IF(ISERROR(INDIRECT(CONCATENATE($E$32,\"!L224\"))),\"\",INDIRECT(CONCATENATE($E$32,\"!L224\")))","v":"N/A"}]
[]
[]
[null,null,null,null,null,null,"RURAL",null,null,{"$f":"IF(ISERROR(INDIRECT(CONCATENATE(#REF!,\"!A2\"))),\"\",INDIRECT(CONCATENATE(#REF!,\"!A210\")))","v":""},{"$f":"IF(ISERROR(INDIRECT(CONCATENATE($E$32,\"!M222\"))),\"\",INDIRECT(CONCATENATE($E$32,\"!M222\")))","v":"N/A"},{"$f":"IF(ISERROR(INDIRECT(CONCATENATE($E$32,\"!M223\"))),\"\",INDIRECT(CONCATENATE($E$32,\"!M223\")))","v":"N/A"},{"$f":"IF(ISERROR(INDIRECT(CONCATENATE($E$32,\"!M224\"))),\"\",INDIRECT(CONCATENATE($E$32,\"!M224\")))","v":"N/A"},{"$f":"IF(ISERROR(INDIRECT(CONCATENATE($E$32,\"!N222\"))),\"\",INDIRECT(CONCATENATE($E$32,\"!N222\")))","v":"N/A"},{"$f":"IF(ISERROR(INDIRECT(CONCATENATE($E$32,\"!N223\"))),\"\",INDIRECT(CONCATENATE($E$32,\"!N223\")))","v":"N/A"},{"$f":"IF(ISERROR(INDIRECT(CONCATENATE($E$32,\"!N224\"))),\"\",INDIRECT(CONCATENATE($E$32,\"!N224\")))","v":"N/A"},{"$f":"IF(ISERROR(INDIRECT(CONCATENATE($E$32,\"!O222\"))),\"\",INDIRECT(CONCATENATE($E$32,\"!O222\")))","v":"N/A"},{"$f":"IF(ISERROR(INDIRECT(CONCATENATE($E$32,\"!O223\"))),\"\",INDIRECT(CONCATENATE($E$32,\"!O223\")))","v":"N/A"},{"$f":"IF(ISERROR(INDIRECT(CONCATENATE($E$32,\"!O224\"))),\"\",INDIRECT(CONCATENATE($E$32,\"!O224\")))","v":"N/A"},{"$f":"IF(ISERROR(INDIRECT(CONCATENATE($E$32,\"!P222\"))),\"\",INDIRECT(CONCATENATE($E$32,\"!P222\")))","v":"N/A"},{"$f":"IF(ISERROR(INDIRECT(CONCATENATE($E$32,\"!P223\"))),\"\",INDIRECT(CONCATENATE($E$32,\"!P223\")))","v":"N/A"},{"$f":"IF(ISERROR(INDIRECT(CONCATENATE($E$32,\"!P224\"))),\"\",INDIRECT(CONCATENATE($E$32,\"!P224\")))","v":"N/A"},{"$f":"IF(ISERROR(INDIRECT(CONCATENATE($E$32,\"!Q222\"))),\"\",INDIRECT(CONCATENATE($E$32,\"!Q222\")))","v":"N/A"},{"$f":"IF(ISERROR(INDIRECT(CONCATENATE($E$32,\"!Q223\"))),\"\",INDIRECT(CONCATENATE($E$32,\"!Q223\")))","v":"N/A"},{"$f":"IF(ISERROR(INDIRECT(CONCATENATE($E$32,\"!Q224\"))),\"\",INDIRECT(CONCATENATE($E$32,\"!Q224\")))","v":"N/A"}]
[]
[]
[]
[]
[]
[]
[]
[]
[]
[]
[]
[]
[]
[]
[]
[]
[]
[]
[]
[]
[]
[]
[]
[]
[]
[]
[]
[]
[]
[]
[]
[]
[]
[]
[]
[]
[]
[]
[]
[]
[]
[]
[]
[]
[]
[]
[]
[2,"MICS05"]
[null,"MICS12"]
[null,"Template"]

{"sheet":"MICS05","index":4,"n_rows":1072,"n_cols":76,"rows_kept":1072,"cut":false,"hidden":false,"merged":[[340,52,341,52],[342,52,343,52],[344,52,345,52],[346,52,347,52],[348,52,349,52],[350,52,351,52],[352,52,353,52],[152,52,160,52],[219,54,219,58],[219,59,219,63],[219,64,219,68],[221,52,223,52],[224,52,225,52],[226,52,229,52],[258,54,258,58],[258,59,258,63],[258,64,258,68],[260,52,262,52],[263,52,266,52],[267,52,269,52],[270,52,272,52],[273,52,275,52],[276,52,283,52],[338,54,338,58],[338,59,338,63],[338,64,338,68],[139,52,142,52],[143,0,146,0],[143,52,146,52],[147,0,149,0],[147,52,149,52],[150,0,151,0],[150,52,151,52],[13,54,13,58],[13,59,13,63],[13,64,13,68],[15,52,16,52],[17,52,20,52],[21,52,22,52],[26,54,26,58],[26,59,26,63],[26,64,26,68],[55,54,55,58],[55,59,55,63],[55,64,55,68],[119,54,119,58],[119,59,119,63],[119,64,119,68],[121,52,122,52],[123,52,126,52],[127,52,128,52],[132,54,132,58],[132,59,132,63],[132,64,132,68],[134,52,138,52],[34,52,35,52],[36,52,37,52],[38,0,39,0],[38,52,39,52],[40,52,41,52],[42,52,43,52],[44,52,45,52],[46,0,48,0],[46,52,48,52],[49,0,51,0],[49,52,51,52],[52,0,54,0],[52,52,54,52],[13,12,13,16],[15,0,16,0],[17,0,20,0],[21,0,22,0],[23,0,25,0],[13,2,13,6],[13,7,13,11],[28,52,29,52],[30,0,31,0],[30,52,31,52],[32,0,33,0],[32,52,33,52],[55,2,55,6],[55,7,55,11],[55,12,55,16],[28,0,29,0],[34,0,35,0],[36,0,37,0],[40,0,41,0],[42,0,43,0],[44,0,45,0],[26,2,26,6],[26,7,26,11],[26,12,26,16],[139,0,142,0],[119,12,119,16],[121,0,122,0],[123,0,126,0],[127,0,128,0],[129,0,131,0],[107,0,107,1],[119,2,119,6],[119,7,119,11],[57,0,63,0],[207,0,207,1],[152,0,159,0],[132,2,132,6],[132,7,132,11],[132,12,132,16],[134,0,138,0],[1024,0,1024,2],[1025,0,1025,1],[1030,0,1032,0],[1033,0,1033,2],[398,2,398,5],[221,0,223,0],[219,2,219,6],[219,7,219,11],[219,12,219,16],[401,1,444,1],[402,2,402,3],[402,7,402,8],[402,12,402,13],[403,2,403,3],[403,7,403,8],[403,12,403,13],[404,2,404,3],[404,7,404,8],[404,12,404,13],[398,7,398,10],[398,12,398,15],[399,2,399,4],[399,7,399,9],[399,12,399,14],[400,2,401,3],[400,7,401,8],[400,12,401,13],[409,2,409,3],[409,7,409,8],[409,12,409,13],[410,2,410,3],[410,7,410,8],[410,12,410,13],[407,2,407,3],[407,7,407,8],[407,12,407,13],[408,2,408,3],[408,7,408,8],[408,12,408,13],[405,2,405,3],[405,7,405,8],[405,12,405,13],[406,2,406,3],[406,7,406,8],[406,12,406,13],[415,2,415,3],[415,7,415,8],[415,12,415,13],[416,2,416,3],[416,7,416,8],[416,12,416,13],[413,2,413,3],[413,7,413,8],[413,12,413,13],[414,2,414,3],[414,7,414,8],[414,12,414,13],[411,2,411,3],[411,7,411,8],[411,12,411,13],[412,2,412,3],[412,7,412,8],[412,12,412,13],[421,2,421,3],[421,7,421,8],[421,12,421,13],[422,2,422,3],[422,7,422,8],[422,12,422,13],[419,2,419,3],[419,7,419,8],[419,12,419,13],[420,2,420,3],[420,7,420,8],[420,12,420,13],[417,2,417,3],[417,7,417,8],[417,12,417,13],[418,2,418,3],[418,7,418,8],[418,12,418,13],[427,2,427,3],[427,7,427,8],[427,12,427,13],[428,2,428,3],[428,7,428,8],[428,12,428,13],[425,2,425,3],[425,7,425,8],[425,12,425,13],[426,2,426,3],[426,7,426,8],[426,12,426,13],[423,2,423,3],[423,7,423,8],[423,12,423,13],[424,2,424,3],[424,7,424,8],[424,12,424,13],[433,2,433,3],[433,7,433,8],[433,12,433,13],[434,2,434,3],[434,7,434,8],[434,12,434,13],[431,2,431,3],[431,7,431,8],[431,12,431,13],[432,2,432,3],[432,7,432,8],[432,12,432,13],[429,2,429,3],[429,7,429,8],[429,12,429,13],[430,2,430,3],[430,7,430,8],[430,12,430,13],[439,2,439,3],[439,7,439,8],[439,12,439,13],[440,2,440,3],[440,7,440,8],[440,12,440,13],[437,2,437,3],[437,7,437,8],[437,12,437,13],[438,2,438,3],[438,7,438,8],[438,12,438,13],[435,2,435,3],[435,7,435,8],[435,12,435,13],[436,2,436,3],[436,7,436,8],[436,12,436,13],[445,2,445,3],[445,7,445,8],[445,12,445,14],[446,2,446,3],[446,7,446,9],[446,12,446,13],[443,2,443,3],[443,7,443,8],[443,12,443,13],[444,2,444,3],[444,7,444,8],[444,12,444,13],[441,2,441,3],[441,7,441,8],[441,12,441,13],[442,2,442,3],[442,7,442,8],[442,12,442,13],[451,2,451,3],[451,7,451,8],[451,12,451,13],[452,2,452,3],[452,7,452,8],[452,12,452,13],[449,2,449,3],[449,7,449,8],[449,12,449,13],[450,2,450,3],[450,7,450,8],[450,12,450,13],[447,2,447,4],[447,7,447,8],[447,12,447,13],[448,2,448,3],[448,7,448,8],[448,12,448,13],[457,2,457,3],[457,7,457,8],[457,12,457,13],[458,2,458,3],[458,7,458,8],[458,12,458,13],[455,2,455,3],[455,7,455,8],[455,12,455,13],[456,2,456,3],[456,7,456,8],[456,12,456,13],[453,2,453,3],[453,7,453,8],[453,12,453,13],[454,2,454,3],[454,7,454,8],[454,12,454,13],[463,2,463,3],[463,7,463,8],[463,12,463,13],[464,2,464,3],[464,7,464,8],[464,12,464,13],[461,2,461,3],[461,7,461,8],[461,12,461,13],[462,2,462,3],[462,7,462,8],[462,12,462,13],[459,2,459,3],[459,7,459,8],[459,12,459,13],[460,2,460,3],[460,7,460,8],[460,12,460,13],[469,2,469,3],[469,7,469,8],[469,12,469,13],[470,2,470,3],[470,7,470,8],[470,12,470,13],[467,2,467,3],[467,7,467,8],[467,12,467,13],[468,2,468,3],[468,7,468,8],[468,12,468,13],[465,2,465,3],[465,7,465,8],[465,12,465,13],[466,2,466,3],[466,7,466,8],[466,12,466,13],[475,2,475,3],[475,7,475,8],[475,12,475,13],[476,2,476,3],[476,7,476,8],[476,12,476,13],[473,2,473,3],[473,7,473,8],[473,12,473,13],[474,2,474,3],[474,7,474,8],[474,12,474,13],[471,2,471,3],[471,7,471,8],[471,12,471,13],[472,2,472,3],[472,7,472,8],[472,12,472,13],[481,2,481,3],[481,7,481,8],[481,12,481,13],[482,2,482,3],[482,7,482,8],[482,12,482,13],[479,2,479,3],[479,7,479,8],[479,12,479,13],[480,2,480,3],[480,7,480,8],[480,12,480,13],[477,2,477,3],[477,7,477,8],[477,12,477,13],[478,2,478,3],[478,7,478,8],[478,12,478,13],[487,2,487,3],[487,7,487,8],[487,12,487,13],[488,2,488,3],[488,7,488,8],[488,12,488,13],[485,2,485,3],[485,7,485,8],[485,12,485,13],[486,2,486,3],[486,7,486,8],[486,12,486,13],[483,2,483,3],[483,7,483,8],[483,12,483,13],[484,2,484,3],[484,7,484,8],[484,12,484,13],[494,2,495,3],[494,4,494,6],[494,7,494,8],[494,12,494,13],[495,7,495,8],[495,12,495,14],[492,2,492,3],[492,7,493,8],[492,9,492,11],[492,12,492,13],[493,2,493,6],[493,12,493,13],[489,2,489,3],[489,7,489,8],[489,12,489,16],[490,2,490,3],[490,7,490,8],[490,12,491,13],[490,14,490,16],[491,2,491,3],[491,7,491,11],[503,2,503,3],[503,7,503,8],[503,12,503,13],[504,2,504,3],[504,7,504,8],[504,12,504,13],[500,2,501,3],[500,7,500,8],[500,12,500,13],[501,7,501,8],[501,12,501,13],[502,2,502,3],[502,7,502,8],[502,12,502,13],[496,2,496,3],[496,7,496,8],[496,12,497,13],[497,2,497,3],[497,7,497,9],[498,2,498,3],[498,7,499,8],[498,12,498,13],[499,2,499,4],[499,12,499,13],[509,2,509,3],[509,7,509,8],[509,12,509,13],[510,2,510,3],[510,7,510,8],[510,12,510,13],[507,2,507,3],[507,7,507,8],[507,12,507,13],[508,2,508,3],[508,7,508,8],[508,12,508,13],[505,2,505,3],[505,7,505,8],[505,12,505,13],[506,2,506,3],[506,7,506,8],[506,12,506,13],[515,2,515,3],[515,7,515,8],[515,12,515,13],[516,2,516,3],[516,7,516,8],[516,12,516,13],[513,2,513,3],[513,7,513,8],[513,12,513,13],[514,2,514,3],[514,7,514,8],[514,12,514,13],[511,2,511,3],[511,7,511,8],[511,12,511,13],[512,2,512,3],[512,7,512,8],[512,12,512,13],[521,2,521,3],[521,7,521,8],[521,12,521,13],[522,2,522,3],[522,7,522,8],[522,12,522,13],[519,2,519,3],[519,7,519,8],[519,12,519,13],[520,2,520,3],[520,7,520,8],[520,12,520,13],[517,2,517,3],[517,7,517,8],[517,12,517,13],[518,2,518,3],[518,7,518,8],[518,12,518,13],[527,2,527,3],[527,7,527,8],[527,12,527,13],[528,2,528,3],[528,7,528,8],[528,12,528,13],[525,2,525,3],[525,7,525,8],[525,12,525,13],[526,2,526,3],[526,7,526,8],[526,12,526,13],[523,2,523,3],[523,7,523,8],[523,12,523,13],[524,2,524,3],[524,7,524,8],[524,12,524,13],[533,2,533,3],[533,7,533,8],[533,12,533,13],[534,2,534,3],[534,7,534,8],[534,12,534,13],[531,2,531,3],[531,7,531,8],[531,12,531,13],[532,2,532,3],[532,7,532,8],[532,12,532,13],[529,2,529,3],[529,7,529,8],[529,12,529,13],[530,2,530,3],[530,7,530,8],[530,12,530,13],[539,2,539,3],[539,7,539,8],[539,12,539,13],[540,2,540,3],[540,7,540,8],[540,12,540,14],[537,2,537,3],[537,7,537,8],[537,12,537,13],[538,2,538,3],[538,7,538,8],[538,12,538,13],[535,2,535,3],[535,7,535,8],[535,12,535,13],[536,2,536,3],[536,7,536,8],[536,12,536,13],[545,2,545,3],[545,7,545,8],[545,12,545,13],[546,2,546,4],[546,7,546,8],[546,12,546,13],[543,2,543,3],[543,7,543,9],[543,12,543,13],[544,2,544,3],[544,7,544,8],[544,12,544,13],[541,2,541,3],[541,7,541,8],[541,12,541,13],[542,2,542,3],[542,7,542,8],[542,12,542,13],[551,2,551,3],[551,7,551,8],[551,12,551,13],[552,2,552,3],[552,7,552,8],[552,12,552,13],[549,2,549,3],[549,7,549,8],[549,12,549,13],[550,2,550,3],[550,7,550,8],[550,12,550,13],[547,2,547,3],[547,7,547,8],[547,12,547,13],[548,2,548,3],[548,7,548,8],[548,12,548,13],[557,2,557,3],[557,7,557,8],[557,12,557,13],[558,2,558,3],[558,7,558,8],[558,12,558,13],[555,2,555,3],[555,7,555,8],[555,12,555,13],[556,2,556,3],[556,7,556,8],[556,12,556,13],[553,2,553,3],[553,7,553,8],[553,12,553,13],[554,2,554,3],[554,7,554,8],[554,12,554,13],[563,2,563,3],[563,7,563,8],[563,12,563,13],[564,2,564,3],[564,7,564,8],[564,12,564,13],[561,2,561,3],[561,7,561,8],[561,12,561,13],[562,2,562,3],[562,7,562,8],[562,12,562,13],[559,2,559,3],[559,7,559,8],[559,12,559,13],[560,2,560,3],[560,7,560,8],[560,12,560,13],[569,2,569,3],[569,7,569,8],[569,12,569,13],[570,2,570,3],[570,7,570,8],[570,12,570,13],[567,2,567,3],[567,7,567,8],[567,12,567,13],[568,2,568,3],[568,7,568,8],[568,12,568,13],[565,2,565,3],[565,7,565,8],[565,12,565,13],[566,2,566,3],[566,7,566,8],[566,12,566,13],[575,2,575,3],[575,7,575,8],[575,12,575,13],[576,2,576,3],[576,7,576,8],[576,12,576,13],[573,2,573,3],[573,7,573,8],[573,12,573,13],[574,2,574,3],[574,7,574,8],[574,12,574,13],[571,2,571,3],[571,7,571,8],[571,12,571,13],[572,2,572,3],[572,7,572,8],[572,12,572,13],[581,2,581,3],[581,7,581,8],[581,12,581,13],[582,2,582,3],[582,7,582,8],[582,12,582,13],[579,2,579,3],[579,7,579,8],[579,12,579,13],[580,2,580,3],[580,7,580,8],[580,12,580,13],[577,2,577,3],[577,7,577,8],[577,12,577,13],[578,2,578,3],[578,7,578,8],[578,12,578,13],[587,2,587,3],[587,7,587,8],[587,12,587,13],[588,2,588,3],[588,7,588,8],[588,12,588,13],[585,2,585,3],[585,7,585,8],[585,12,585,13],[586,2,586,3],[586,7,586,8],[586,12,586,13],[583,2,583,3],[583,7,583,8],[583,12,583,13],[584,2,584,3],[584,7,584,8],[584,12,584,13],[593,2,593,3],[593,7,593,8],[593,12,593,13],[594,2,594,3],[594,7,594,8],[594,12,594,13],[591,2,591,3],[591,7,591,8],[591,12,591,13],[592,2,592,3],[592,7,592,8],[592,12,592,13],[589,2,589,3],[589,7,589,8],[589,12,589,13],[590,2,590,3],[590,7,590,8],[590,12,590,13],[599,2,599,3],[599,7,599,8],[599,12,599,13],[600,2,600,3],[600,7,600,8],[600,12,600,13],[597,2,597,3],[597,7,597,8],[597,12,597,13],[598,2,598,3],[598,7,598,8],[598,12,598,13],[595,2,595,3],[595,7,595,8],[595,12,595,13],[596,2,596,3],[596,7,596,8],[596,12,596,13],[605,2,605,3],[605,7,605,8],[605,12,605,13],[606,2,606,3],[606,7,606,8],[606,12,606,13],[603,2,603,3],[603,7,603,8],[603,12,603,13],[604,2,604,3],[604,7,604,8],[604,12,604,13],[601,2,601,3],[601,7,601,8],[601,12,601,13],[602,2,602,3],[602,7,602,8],[602,12,602,13],[611,2,611,3],[611,7,611,8],[611,12,611,13],[612,2,612,3],[612,7,612,8],[612,12,612,13],[609,2,609,3],[609,7,609,8],[609,12,609,13],[610,2,610,3],[610,7,610,8],[610,12,610,13],[607,2,607,3],[607,7,607,8],[607,12,607,13],[608,2,608,3],[608,7,608,8],[608,12,608,13],[617,2,617,3],[617,7,617,8],[617,12,617,13],[618,2,618,3],[618,7,618,8],[618,12,618,13],[615,2,615,3],[615,7,615,8],[615,12,615,13],[616,2,616,3],[616,7,616,8],[616,12,616,13],[613,2,613,3],[613,7,613,8],[613,12,613,13],[614,2,614,3],[614,7,614,8],[614,12,614,13],[623,2,623,3],[623,7,623,8],[623,12,623,13],[624,2,624,3],[624,7,624,8],[624,12,624,13],[621,2,621,3],[621,7,621,8],[621,12,621,13],[622,2,622,3],[622,7,622,8],[622,12,622,13],[619,2,619,3],[619,7,619,8],[619,12,619,13],[620,2,620,3],[620,7,620,8],[620,12,620,13],[629,2,629,3],[629,7,629,8],[629,12,629,13],[630,2,630,3],[630,7,630,8],[630,12,630,13],[627,2,627,3],[627,7,627,8],[627,12,627,13],[628,2,628,3],[628,7,628,8],[628,12,628,13],[625,2,625,3],[625,7,625,8],[625,12,625,13],[626,2,626,3],[626,7,626,8],[626,12,626,13],[635,2,635,3],[635,7,635,8],[635,12,635,13],[636,2,636,3],[636,7,636,8],[636,12,636,13],[633,2,633,3],[633,7,633,8],[633,12,633,13],[634,2,634,3],[634,7,634,8],[634,12,634,13],[631,2,631,3],[631,7,631,8],[631,12,631,13],[632,2,632,3],[632,7,632,8],[632,12,632,13],[641,2,641,3],[641,7,641,8],[641,12,641,13],[642,2,642,3],[642,7,642,8],[642,12,642,13],[639,2,639,3],[639,7,639,8],[639,12,639,13],[640,2,640,3],[640,7,640,8],[640,12,640,13],[637,2,637,3],[637,7,637,8],[637,12,637,13],[638,2,638,3],[638,7,638,8],[638,12,638,13],[647,2,647,3],[647,7,647,8],[647,12,647,13],[648,2,648,3],[648,7,648,8],[648,12,648,13],[645,2,645,3],[645,7,645,8],[645,12,645,13],[646,2,646,3],[646,7,646,8],[646,12,646,13],[643,2,643,3],[643,7,643,8],[643,12,643,13],[644,2,644,3],[644,7,644,8],[644,12,644,13],[653,2,653,3],[653,7,653,8],[653,12,653,13],[654,2,654,3],[654,7,654,8],[654,12,654,13],[651,2,651,3],[651,7,651,8],[651,12,651,13],[652,2,652,3],[652,7,652,8],[652,12,652,13],[649,2,649,3],[649,7,649,8],[649,12,649,13],[650,2,650,3],[650,7,650,8],[650,12,650,13],[659,2,659,3],[659,7,659,8],[659,12,659,13],[660,2,660,3],[660,7,660,8],[660,12,660,13],[657,2,657,3],[657,7,657,8],[657,12,657,13],[658,2,658,3],[658,7,658,8],[658,12,658,13],[655,2,655,3],[655,7,655,8],[655,12,655,13],[656,2,656,3],[656,7,656,8],[656,12,656,13],[665,2,665,3],[665,7,665,8],[665,12,665,13],[666,2,666,3],[666,7,666,8],[666,12,666,13],[663,2,663,3],[663,7,663,8],[663,12,663,13],[664,2,664,3],[664,7,664,8],[664,12,664,13],[661,2,661,3],[661,7,661,8],[661,12,661,13],[662,2,662,3],[662,7,662,8],[662,12,662,13],[671,2,671,3],[671,7,671,8],[671,12,671,13],[672,2,672,3],[672,7,672,8],[672,12,672,13],[669,2,669,3],[669,7,669,8],[669,12,669,13],[670,2,670,3],[670,7,670,8],[670,12,670,13],[667,2,667,3],[667,7,667,8],[667,12,667,13],[668,2,668,3],[668,7,668,8],[668,12,668,13],[677,2,677,3],[677,7,677,8],[677,12,677,13],[678,2,678,3],[678,7,678,8],[678,12,678,13],[675,2,675,3],[675,7,675,8],[675,12,675,13],[676,2,676,3],[676,7,676,8],[676,12,676,13],[673,2,673,3],[673,7,673,8],[673,12,673,13],[674,2,674,3],[674,7,674,8],[674,12,674,13],[683,2,683,3],[683,7,683,8],[683,12,683,13],[684,2,684,3],[684,7,684,8],[684,12,684,13],[681,2,681,3],[681,7,681,8],[681,12,681,13],[682,2,682,3],[682,7,682,8],[682,12,682,13],[679,2,679,3],[679,7,679,8],[679,12,679,13],[680,2,680,3],[680,7,680,8],[680,12,680,13],[689,2,689,3],[689,7,689,8],[689,12,689,13],[690,2,690,3],[690,7,690,8],[690,12,690,13],[687,2,687,3],[687,7,687,8],[687,12,687,13],[688,2,688,3],[688,7,688,8],[688,12,688,13],[685,2,685,3],[685,7,685,8],[685,12,685,13],[686,2,686,3],[686,7,686,8],[686,12,686,13],[695,2,695,3],[695,7,695,8],[695,12,695,13],[696,2,696,3],[696,7,696,8],[696,12,696,13],[693,2,693,3],[693,7,693,8],[693,12,693,13],[694,2,694,3]],"merged_total":1314,"flags":["merged_cut"]}
[]
[{"$f":"A1026","v":"Belarus"}]
[{"$f":"A1034","v":"2005"}]
["Use of drinking water sources"]
[" by wealth quintile and sub-national region"]
["Notes:"]
["WHO/UNICEF JMP customised wealth index excludes water,"]
[" sanitation and hygiene assets."]
["Survey used for analysis:",{"$f":"A1025","v":"MICS05"}]
[{"$f":"B1028","v":""}]
[{"$f":"B1027","v":""}]
[]
[]
["Use of drinking water sources",null,"NATIONAL wealth index quintile",null,null,null,null,"URBAN wealth index quintile",null,null,null,null,"RURAL wealth index quintile",null,null,null,null,"SUB-REGIONS:",null,null,null,null,null,null,null,null,null,null,null,null,null,null,null,null,null,null,null,null,null,null,null,null,null,null,null,null,null,null,null,null,null,null,"Raw numbers of respondents:","Use of drinking water sources","NATIONAL wealth index quintile",null,null,null,null,"URBAN wealth index quintile",null,null,null,null,"RURAL wealth index quintile",null,null,null,null,"SUB-REGIONS:"]
["Weighted percentage (used in graphs)",null,"Poorest","Poor","Middle","Rich","Richest","Poorest","Poor","Middle","Rich","Richest","Poorest","Poor","Middle","Rich","Richest","Brest","Gomel","Grodno","Minsk","Minsk city","Mogilev","Vitebsk",null,null,null,null,null,null,null,null,null,null,null,null,null,null,null,null,null,null,null,null,null,null,null,null,null,null,null,null,"Water data, raw numbers (weighted)",null,"Poorest","Poor","Middle","Rich","Richest","Poorest","Poor","Middle","Rich","Richest","Poorest","Poor","Middle","Rich","Richest","Brest","Gomel","Grodno","Minsk","Minsk city","Mogilev","Vitebsk"]
["Water","Improved",98.707564251832835,99.459079402752266,99.962174886417841,100,99.971818448206363,99.084816667990268,99.942851436570834,100,100,99.957358266827356,98.297895386308028,98.675599898484407,99.401109117264042,100,100,100,99.773295091844574,98.34785421692284,99.413500485578226,100,99.8115067354627,99.825864721143247,null,null,null,null,null,null,null,null,null,null,null,null,null,null,null,null,null,null,null,null,null,null,null,null,null,null,null,null,"Water","Improved","N/A","N/A","N/A","N/A","N/A","N/A","N/A","N/A","N/A","N/A","N/A","N/A","N/A","N/A","N/A","N/A","N/A","N/A","N/A","N/A","N/A","N/A"]
[null,"Not Improved",1.292435748167134,0.54092059724774677,3.7825113582160098E-2,0,2.8181551793645239E-2,0.91518333200976032,5.7148563429181065E-2,0,0,4.2641733172628184E-2,1.7021046136919911,1.324400101515594,0.59889088273593372,0,0,0,0.22670490815539943,1.6521457830771449,0.5864995144217604,0,0.18849326453734874,0.1741352788567509,null,null,null,null,null,null,null,null,null,null,null,null,null,null,null,null,null,null,null,null,null,null,null,null,null,null,null,null,null,"Not Improved","N/A","N/A","N/A","N/A","N/A","N/A","N/A","N/A","N/A","N/A","N/A","N/A","N/A","N/A","N/A","N/A","N/A","N/A","N/A","N/A","N/A","N/A"]
["Water ladder","Basic",{"$f":"C16*C23/100","v":98.572769879776629},{"$f":"D16*D23/100","v":99.459079402752266},{"$f":"E16*E23/100","v":99.962174886417827},99.950265219397522,99.929053669804802,98.880607464916665,99.942851436570834,99.924503840986247,100,99.892611213564138,98.297895386308028,98.675599898484421,99.401109117264042,100,100,100,99.773295091844574,98.279345974989042,99.413500485578226,100,99.8115067354627,99.558350747679683,null,null,null,null,null,null,null,null,null,null,null,null,null,null,null,null,null,null,null,null,null,null,null,null,null,null,null,null,"Water ladder","Basic","N/A","N/A","N/A","N/A","N/A","N/A","N/A","N/A","N/A","N/A","N/A","N/A","N/A","N/A","N/A","N/A","N/A","N/A","N/A","N/A","N/A","N/A"]
[null,"Limited",{"$f":"C16*C22/100","v":0.13479437205620523},{"$f":"D16*D22/100","v":0},{"$f":"E16*E22/100","v":0},4.9734780602466812E-2,4.2764778401552697E-2,0.20420920307359963,0,7.5496159013745359E-2,0,6.4747053263193188E-2,0,0,0,0,0,0,0,6.8508241933802394E-2,0,0,0,0.26751397346355321,null,null,null,null,null,null,null,null,null,null,null,null,null,null,null,null,null,null,null,null,null,null,null,null,null,null,null,null,null,"Limited","N/A","N/A","N/A","N/A","N/A","N/A","N/A","N/A","N/A","N/A","N/A","N/A","N/A","N/A","N/A","N/A","N/A","N/A","N/A","N/A","N/A","N/A"]
[null,"Unimproved",{"$f":"100-C18-C19-C21","v":1.2924357481671653},{"$f":"100-D18-D19-D21","v":0.54092059724773378},{"$f":"100-E18-E19-E21","v":3.7825113582172776E-2},1.0901002323038256E-14,2.8181551793645773E-2,0.91518333200973578,5.7148563429166188E-2,7.2580830234869609E-15,0,4.2641733172669283E-2,1.7021046136919722,1.3244001015155789,0.59889088273595803,0,0,0,0.22670490815542621,1.652145783077156,0.58649951442177439,0,0.18849326453729986,0.17413527885676428,null,null,null,null,null,null,null,null,null,null,null,null,null,null,null,null,null,null,null,null,null,null,null,null,null,null,null,null,null,"Unimproved","N/A","N/A","N/A","N/A","N/A","N/A","N/A","N/A","N/A","N/A","N/A","N/A","N/A","N/A","N/A","N/A","N/A","N/A","N/A","N/A","N/A","N/A"]
[null,"Surface water",0,0,0,0,0,0,0,0,0,0,0,0,0,0,0,0,0,0,0,0,0,0,null,null,null,null,null,null,null,null,null,null,null,null,null,null,null,null,null,null,null,null,null,null,null,null,null,null,null,null,null,"Surface water","N/A","N/A","N/A","N/A","N/A","N/A","N/A","N/A","N/A","N/A","N/A","N/A","N/A","N/A","N/A","N/A","N/A","N/A","N/A","N/A","N/A","N/A"]
["Improved water point at more than 30 minutes","Yes",0.13655931344056271,0,0,4.9734780602466812E-2,4.2776833577062898E-2,0.20609535339592569,0,7.5496159013745359E-2,0,6.4774674306974617E-2,0,0,0,0,0,0,0,6.9659112015495406E-2,0,0,0,0.26798062226742064,null,null,null,null,null,null,null,null,null,null,null,null,null,null,null,null,null,null,null,null,null,null,null,null,null,null,null,null,"Improved water point at more than 30 minutes","Yes","N/A","N/A","N/A","N/A","N/A","N/A","N/A","N/A","N/A","N/A","N/A","N/A","N/A","N/A","N/A","N/A","N/A","N/A","N/A","N/A","N/A","N/A"]
[null,"No",99.863440686559429,100,100,99.950265219397522,99.957223166422921,99.793904646604076,100,99.924503840986247,100,99.935225325693011,100,100,100,100,100,100,100,99.930340887984514,100,100,100,99.73201937773257,null,null,null,null,null,null,null,null,null,null,null,null,null,null,null,null,null,null,null,null,null,null,null,null,null,null,null,null,null,"No","N/A","N/A","N/A","N/A","N/A","N/A","N/A","N/A","N/A","N/A","N/A","N/A","N/A","N/A","N/A","N/A","N/A","N/A","N/A","N/A","N/A","N/A"]
["Manually calculated ratios","Improved wells"]
[null,"Improved springs"]
[null,"Other"]
[null,null,"NATIONAL wealth index quintile",null,null,null,null,"URBAN wealth index quintile",null,null,null,null,"RURAL wealth index quintile",null,null,null,null,"SUB-REGIONS:",null,null,null,null,null,null,null,null,null,null,null,null,null,null,null,null,null,null,null,null,null,null,null,null,null,null,null,null,null,null,null,null,null,null,"Raw numbers of respondents:","Use of drinking water sources","NATIONAL wealth index quintile",null,null,null,null,"URBAN wealth index quintile",null,null,null,null,"RURAL wealth index quintile",null,null,null,null,"SUB-REGIONS:"]
["Percentage based on weighted population",null,"Poorest","Poor","Middle","Rich","Richest","Poorest","Poor","Middle","Rich","Richest","Poorest","Poor","Middle","Rich","Richest","Brest","Gomel","Grodno","Minsk","Minsk city","Mogilev","Vitebsk",null,null,null,null,null,null,null,null,null,null,null,null,null,null,null,null,null,null,null,null,null,null,null,null,null,null,null,null,"Water data, raw numbers (weighted)",null,"Poorest","Poor","Middle","Rich","Richest","Poorest","Poor","Middle","Rich","Richest","Poorest","Poor","Middle","Rich","Richest","Brest","Gomel","Grodno","Minsk","Minsk city","Mogilev","Vitebsk"]
["Piped water","Yes",52.641690944063427,87.721372857878933,98.308983119601194,99.373925638162603,99.07229967531363,86.329949730883044,99.384427597328894,99.861590375141461,99.84395116861829,99.82993905290185,36.632681265291865,50.367195473941159,72.627104138017131,90.976668779793229,92.523318490125135,85.185866090792487,90.961666911657119,78.724526580896239,82.176022003711651,100,92.373914061340471,81.000434106913417,null,null,null,null,null,null,null,null,null,null,null,null,null,null,null,null,null,null,null,null,null,null,null,null,null,null,null,null,"Piped water","Yes","N/A","N/A","N/A","N/A","N/A","N/A","N/A","N/A","N/A","N/A","N/A","N/A","N/A","N/A","N/A","N/A","N/A","N/A","N/A","N/A","N/A","N/A"]
[null,"No",47.358309055936424,12.278627142121236,1.691016880398805,0.62607436183739185,0.92770032468638564,13.670050269116862,0.61557240267109703,0.13840962485853317,0.15604883138169426,0.17006094709812547,63.367318734708341,49.632804526058692,27.372895861982915,9.0233312202067548,7.4766815098748625,14.814133909207476,9.0383330883428901,21.275473419103999,17.823977996288196,0,7.6260859386597009,18.99956589308654,null,null,null,null,null,null,null,null,null,null,null,null,null,null,null,null,null,null,null,null,null,null,null,null,null,null,null,null,null,"No","N/A","N/A","N/A","N/A","N/A","N/A","N/A","N/A","N/A","N/A","N/A","N/A","N/A","N/A","N/A","N/A","N/A","N/A","N/A","N/A","N/A","N/A"]
["Piped water on premises","Yes",35.489863333295759,81.500927020591263,98.108364233068869,99.332738951918913,98.897798569977112,69.147847420155273,99.214166415724819,99.861590375141461,99.697115503174018,99.651183490219381,21.289029784195211,39.754883065718978,64.738783640714146,89.248753431575238,92.393350028167404,83.121702886335797,85.827261789947784,77.627966695569995,76.777268051741174,99.358083354202947,80.364232104738463,72.821374500119447,null,null,null,null,null,null,null,null,null,null,null,null,null,null,null,null,null,null,null,null,null,null,null,null,null,null,null,null,"Piped water on premises","Yes","N/A","N/A","N/A","N/A","N/A","N/A","N/A","N/A","N/A","N/A","N/A","N/A","N/A","N/A","N/A","N/A","N/A","N/A","N/A","N/A","N/A","N/A"]
[null,"No",64.510136666704014,18.499072979408769,1.8916357669311479,0.66726104808107567,1.1022014300229019,30.852152579844617,0.78583358427515271,0.13840962485853317,0.30288449682597823,0.34881650978058643,78.710970215805034,60.245116934280951,35.26121635928591,10.751246568424671,7.6066499718325904,16.878297113664214,14.172738210052183,22.372033304430268,23.222731948258605,0.64191664579707441,19.635767895261701,27.178625499880383,null,null,null,null,null,null,null,null,null,null,null,null,null,null,null,null,null,null,null,null,null,null,null,null,null,null,null,null,null,"No","N/A","N/A","N/A","N/A","N/A","N/A","N/A","N/A","N/A","N/A","N/A","N/A","N/A","N/A","N/A","N/A","N/A","N/A","N/A","N/A","N/A","N/A"]
["Piped water into dwelling","Yes","N/A","N/A","N/A","N/A","N/A","N/A","N/A","N/A","N/A","N/A","N/A","N/A","N/A","N/A","N/A","N/A","N/A","N/A","N/A","N/A","N/A","N/A",null,null,null,null,null,null,null,null,null,null,null,null,null,null,null,null,null,null,null,null,null,null,null,null,null,null,null,null,"Piped water into dwelling","Yes","N/A","N/A","N/A","N/A","N/A","N/A","N/A","N/A","N/A","N/A","N/A","N/A","N/A","N/A","N/A","N/A","N/A","N/A","N/A","N/A","N/A","N/A"]
[null,"No","N/A","N/A","N/A","N/A","N/A","N/A","N/A","N/A","N/A","N/A","N/A","N/A","N/A","N/A","N/A","N/A","N/A","N/A","N/A","N/A","N/A","N/A",null,null,null,null,null,null,null,null,null,null,null,null,null,null,null,null,null,null,null,null,null,null,null,null,null,null,null,null,null,"No","N/A","N/A","N/A","N/A","N/A","N/A","N/A","N/A","N/A","N/A","N/A","N/A","N/A","N/A","N/A","N/A","N/A","N/A","N/A","N/A","N/A","N/A"]
["Water source on premises","Yes",35.489863333295759,81.500927020591263,98.108364233068869,99.332738951918913,98.897798569977112,69.147847420155273,99.214166415724819,99.861590375141461,99.697115503174018,99.651183490219381,21.289029784195211,39.754883065718978,64.738783640714146,89.248753431575238,92.393350028167404,83.121702886335797,85.827261789947784,77.627966695569995,76.777268051741174,99.358083354202947,80.364232104738463,72.821374500119447,null,null,null,null,null,null,null,null,null,null,null,null,null,null,null,null,null,null,null,null,null,null,null,null,null,null,null,null,"Water source on premises","Yes","N/A","N/A","N/A","N/A","N/A","N/A","N/A","N/A","N/A","N/A","N/A","N/A","N/A","N/A","N/A","N/A","N/A","N/A","N/A","N/A","N/A","N/A"]
[null,"No",64.510136666704014,18.499072979408769,1.8916357669311479,0.66726104808107567,1.1022014300229019,30.852152579844617,0.78583358427515271,0.13840962485853317,0.30288449682597823,0.34881650978058643,78.710970215805034,60.245116934280951,35.26121635928591,10.751246568424671,7.6066499718325904,16.878297113664214,14.172738210052183,22.372033304430268,23.222731948258605,0.64191664579707441,19.635767895261701,27.178625499880383,null,null,null,null,null,null,null,null,null,null,null,null,null,null,null,null,null,null,null,null,null,null,null,null,null,null,null,null,null,"No","N/A","N/A","N/A","N/A","N/A","N/A","N/A","N/A","N/A","N/A","N/A","N/A","N/A","N/A","N/A","N/A","N/A","N/A","N/A","N/A","N/A","N/A"]
["Improved Water source on premises","Yes",35.954552827127195,81.944179968285468,98.145487875333473,99.332738951918913,98.925677360979805,69.786522037834843,99.270898308011084,99.861590375141461,99.697115503174018,99.6936946094647,21.657665914951593,40.28846351744307,65.128834291317048,89.248753431575238,92.393350028167404,83.121702886335797,86.022278517453969,78.932039050235275,77.230222934237332,99.358083354202947,80.515999340369973,72.948403405811717,null,null,null,null,null,null,null,null,null,null,null,null,null,null,null,null,null,null,null,null,null,null,null,null,null,null,null,null,"Improved water source on premises","Yes","N/A","N/A","N/A","N/A","N/A","N/A","N/A","N/A","N/A","N/A","N/A","N/A","N/A","N/A","N/A","N/A","N/A","N/A","N/A","N/A","N/A","N/A"]
[null,"No",64.045447172872599,18.055820031714543,1.8545121246665377,0.66726104808107567,1.074322639020203,30.213477962165019,0.7291016919888812,0.13840962485853317,0.30288449682597823,0.30630539053528372,78.34233408504862,59.711536482556852,34.87116570868303,10.751246568424671,7.6066499718325904,16.878297113664214,13.977721482546007,21.067960949764998,22.769777065762465,0.64191664579707441,19.484000659630158,27.051596594188119,null,null,null,null,null,null,null,null,null,null,null,null,null,null,null,null,null,null,null,null,null,null,null,null,null,null,null,null,null,"No","N/A","N/A","N/A","N/A","N/A","N/A","N/A","N/A","N/A","N/A","N/A","N/A","N/A","N/A","N/A","N/A","N/A","N/A","N/A","N/A","N/A","N/A"]
["Piped water on premises available when needed","Yes","N/A","N/A","N/A","N/A","N/A","N/A","N/A","N/A","N/A","N/A","N/A","N/A","N/A","N/A","N/A","N/A","N/A","N/A","N/A","N/A","N/A","N/A",null,null,null,null,null,null,null,null,null,null,null,null,null,null,null,null,null,null,null,null,null,null,null,null,null,null,null,null,"Piped water on premises available when needed","Yes","N/A","N/A","N/A","N/A","N/A","N/A","N/A","N/A","N/A","N/A","N/A","N/A","N/A","N/A","N/A","N/A","N/A","N/A","N/A","N/A","N/A","N/A"]
[null,"No","N/A","N/A","N/A","N/A","N/A","N/A","N/A","N/A","N/A","N/A","N/A","N/A","N/A","N/A","N/A","N/A","N/A","N/A","N/A","N/A","N/A","N/A",null,null,null,null,null,null,null,null,null,null,null,null,null,null,null,null,null,null,null,null,null,null,null,null,null,null,null,null,null,"No","N/A","N/A","N/A","N/A","N/A","N/A","N/A","N/A","N/A","N/A","N/A","N/A","N/A","N/A","N/A","N/A","N/A","N/A","N/A","N/A","N/A","N/A"]
["Water point at more than 30 minutes","Yes",0.17414789802948605,0,0,4.9734780602466812E-2,7.0979648437110646E-2,0.26382273698661202,0,7.5496159013745359E-2,0,0.10746509794280312,0,0,0,0,0,0,3.730260086510568E-2,6.8508241933802394E-2,0,0,6.5281407826269774E-2,0.26751397346355321,null,null,null,null,null,null,null,null,null,null,null,null,null,null,null,null,null,null,null,null,null,null,null,null,null,null,null,null,"Water point at more than 30 minutes","Yes","N/A","N/A","N/A","N/A","N/A","N/A","N/A","N/A","N/A","N/A","N/A","N/A","N/A","N/A","N/A","N/A","N/A","N/A","N/A","N/A","N/A","N/A"]
[null,"No",99.825852101970497,100,100,99.950265219397522,99.929020351562883,99.736177263013403,100,99.924503840986247,100,99.892534902057179,100,100,100,100,100,100,99.962697399134854,99.931491758066187,100,100,99.934718592173724,99.732486026536435,null,null,null,null,null,null,null,null,null,null,null,null,null,null,null,null,null,null,null,null,null,null,null,null,null,null,null,null,null,"No","N/A","N/A","N/A","N/A","N/A","N/A","N/A","N/A","N/A","N/A","N/A","N/A","N/A","N/A","N/A","N/A","N/A","N/A","N/A","N/A","N/A","N/A"]
["Water source available when needed","Yes","N/A","N/A","N/A","N/A","N/A","N/A","N/A","N/A","N/A","N/A","N/A","N/A","N/A","N/A","N/A","N/A","N/A","N/A","N/A","N/A","N/A","N/A",null,null,null,null,null,null,null,null,null,null,null,null,null,null,null,null,null,null,null,null,null,null,null,null,null,null,null,null,"Water source available when needed","Yes","N/A","N/A","N/A","N/A","N/A","N/A","N/A","N/A","N/A","N/A","N/A","N/A","N/A","N/A","N/A","N/A","N/A","N/A","N/A","N/A","N/A","N/A"]
[null,"No","N/A","N/A","N/A","N/A","N/A","N/A","N/A","N/A","N/A","N/A","N/A","N/A","N/A","N/A","N/A","N/A","N/A","N/A","N/A","N/A","N/A","N/A",null,null,null,null,null,null,null,null,null,null,null,null,null,null,null,null,null,null,null,null,null,null,null,null,null,null,null,null,null,"No","N/A","N/A","N/A","N/A","N/A","N/A","N/A","N/A","N/A","N/A","N/A","N/A","N/A","N/A","N/A","N/A","N/A","N/A","N/A","N/A","N/A","N/A"]
["Improved water source available when needed","Yes","N/A","N/A","N/A","N/A","N/A","N/A","N/A","N/A","N/A","N/A","N/A","N/A","N/A","N/A","N/A","N/A","N/A","N/A","N/A","N/A","N/A","N/A",null,null,null,null,null,null,null,null,null,null,null,null,null,null,null,null,null,null,null,null,null,null,null,null,null,null,null,null,"Improved water source available when needed","Yes","N/A","N/A","N/A","N/A","N/A","N/A","N/A","N/A","N/A","N/A","N/A","N/A","N/A","N/A","N/A","N/A","N/A","N/A","N/A","N/A","N/A","N/A"]
[null,"No","N/A","N/A","N/A","N/A","N/A","N/A","N/A","N/A","N/A","N/A","N/A","N/A","N/A","N/A","N/A","N/A","N/A","N/A","N/A","N/A","N/A","N/A",null,null,null,null,null,null,null,null,null,null,null,null,null,null,null,null,null,null,null,null,null,null,null,null,null,null,null,null,null,"No","N/A","N/A","N/A","N/A","N/A","N/A","N/A","N/A","N/A","N/A","N/A","N/A","N/A","N/A","N/A","N/A","N/A","N/A","N/A","N/A","N/A","N/A"]
["Microbiological quality at point of collection","Not contaminated (No E. coli in 100 mL)","N/A","N/A","N/A","N/A","N/A","N/A","N/A","N/A","N/A","N/A","N/A","N/A","N/A","N/A","N/A","N/A","N/A","N/A","N/A","N/A","N/A","N/A",null,null,null,null,null,null,null,null,null,null,null,null,null,null,null,null,null,null,null,null,null,null,null,null,null,null,null,null,"Microbiological quality at point of collection","Not contaminated (No E. coli in 100 mL)","N/A","N/A","N/A","N/A","N/A","N/A","N/A","N/A","N/A","N/A","N/A","N/A","N/A","N/A","N/A","N/A","N/A","N/A","N/A","N/A","N/A","N/A"]
[null,"Contaminated (E. coli detected in 100 mL)","N/A","N/A","N/A","N/A","N/A","N/A","N/A","N/A","N/A","N/A","N/A","N/A","N/A","N/A","N/A","N/A","N/A","N/A","N/A","N/A","N/A","N/A",null,null,null,null,null,null,null,null,null,null,null,null,null,null,null,null,null,null,null,null,null,null,null,null,null,null,null,null,null,"Contaminated (E. coli detected in 100 mL)","N/A","N/A","N/A","N/A","N/A","N/A","N/A","N/A","N/A","N/A","N/A","N/A","N/A","N/A","N/A","N/A","N/A","N/A","N/A","N/A","N/A","N/A"]
[null,"Highly contaminated (>100 CFU/100 mL)","N/A","N/A","N/A","N/A","N/A","N/A","N/A","N/A","N/A","N/A","N/A","N/A","N/A","N/A","N/A","N/A","N/A","N/A","N/A","N/A","N/A","N/A",null,null,null,null,null,null,null,null,null,null,null,null,null,null,null,null,null,null,null,null,null,null,null,null,null,null,null,null,null,"Highly contaminated (>100 CFU/100 mL)","N/A","N/A","N/A","N/A","N/A","N/A","N/A","N/A","N/A","N/A","N/A","N/A","N/A","N/A","N/A","N/A","N/A","N/A","N/A","N/A","N/A","N/A"]
["Microbiological quality of improved water sources at point of collection","Not contaminated (No E. coli in 100 mL)","N/A","N/A","N/A","N/A","N/A","N/A","N/A","N/A","N/A","N/A","N/A","N/A","N/A","N/A","N/A","N/A","N/A","N/A","N/A","N/A","N/A","N/A",null,null,null,null,null,null,null,null,null,null,null,null,null,null,null,null,null,null,null,null,null,null,null,null,null,null,null,null,"Microbiological quality of improved water sources at point of collection","Not contaminated (No E. coli in 100 mL)","N/A","N/A","N/A","N/A","N/A","N/A","N/A","N/A","N/A","N/A","N/A","N/A","N/A","N/A","N/A","N/A","N/A","N/A","N/A","N/A","N/A","N/A"]
[null,"Contaminated (E. coli detected in 100 mL)","N/A","N/A","N/A","N/A","N/A","N/A","N/A","N/A","N/A","N/A","N/A","N/A","N/A","N/A","N/A","N/A","N/A","N/A","N/A","N/A","N/A","N/A",null,null,null,null,null,null,null,null,null,null,null,null,null,null,null,null,null,null,null,null,null,null,null,null,null,null,null,null,null,"Contaminated (E. coli detected in 100 mL)","N/A","N/A","N/A","N/A","N/A","N/A","N/A","N/A","N/A","N/A","N/A","N/A","N/A","N/A","N/A","N/A","N/A","N/A","N/A","N/A","N/A","N/A"]
[null,"Highly contaminated (>100 CFU/100 mL)","N/A","N/A","N/A","N/A","N/A","N/A","N/A","N/A","N/A","N/A","N/A","N/A","N/A","N/A","N/A","N/A","N/A","N/A","N/A","N/A","N/A","N/A",null,null,null,null,null,null,null,null,null,null,null,null,null,null,null,null,null,null,null,null,null,null,null,null,null,null,null,null,null,"Highly contaminated (>100 CFU/100 mL)","N/A","N/A","N/A","N/A","N/A","N/A","N/A","N/A","N/A","N/A","N/A","N/A","N/A","N/A","N/A","N/A","N/A","N/A","N/A","N/A","N/A","N/A"]
["Microbiological quality of piped on premises at point of collection","Not contaminated (No E. coli in 100 mL)","N/A","N/A","N/A","N/A","N/A","N/A","N/A","N/A","N/A","N/A","N/A","N/A","N/A","N/A","N/A","N/A","N/A","N/A","N/A","N/A","N/A","N/A",null,null,null,null,null,null,null,null,null,null,null,null,null,null,null,null,null,null,null,null,null,null,null,null,null,null,null,null,"Microbiological quality of piped on premises at point of collection","Not contaminated (No E. coli in 100 mL)","N/A","N/A","N/A","N/A","N/A","N/A","N/A","N/A","N/A","N/A","N/A","N/A","N/A","N/A","N/A","N/A","N/A","N/A","N/A","N/A","N/A","N/A"]
[null,"Contaminated (E. coli detected in 100 mL)","N/A","N/A","N/A","N/A","N/A","N/A","N/A","N/A","N/A","N/A","N/A","N/A","N/A","N/A","N/A","N/A","N/A","N/A","N/A","N/A","N/A","N/A",null,null,null,null,null,null,null,null,null,null,null,null,null,null,null,null,null,null,null,null,null,null,null,null,null,null,null,null,null,"Contaminated (E. coli detected in 100 mL)","N/A","N/A","N/A","N/A","N/A","N/A","N/A","N/A","N/A","N/A","N/A","N/A","N/A","N/A","N/A","N/A","N/A","N/A","N/A","N/A","N/A","N/A"]
[null,"Highly contaminated (>100 CFU/100 mL)","N/A","N/A","N/A","N/A","N/A","N/A","N/A","N/A","N/A","N/A","N/A","N/A","N/A","N/A","N/A","N/A","N/A","N/A","N/A","N/A","N/A","N/A",null,null,null,null,null,null,null,null,null,null,null,null,null,null,null,null,null,null,null,null,null,null,null,null,null,null,null,null,null,"Highly contaminated (>100 CFU/100 mL)","N/A","N/A","N/A","N/A","N/A","N/A","N/A","N/A","N/A","N/A","N/A","N/A","N/A","N/A","N/A","N/A","N/A","N/A","N/A","N/A","N/A","N/A"]
[null,null,"NATIONAL wealth index quintile",null,null,null,null,"URBAN wealth index quintile",null,null,null,null,"RURAL wealth index quintile",null,null,null,null,"SUB-REGIONS:",null,null,null,null,null,null,null,null,null,null,null,null,null,null,null,null,null,null,null,null,null,null,null,null,null,null,null,null,null,null,null,null,null,null,"Raw numbers of respondents:","Use of drinking water sources","NATIONAL wealth index quintile",null,null,null,null,"URBAN wealth index quintile",null,null,null,null,"RURAL wealth index quintile",null,null,null,null,"SUB-REGIONS:"]
["Percentage based on weighted population",null,"Poorest","Poor","Middle","Rich","Richest","Poorest","Poor","Middle","Rich","Richest","Poorest","Poor","Middle","Rich","Richest","Brest","Gomel","Grodno","Minsk","Minsk city","Mogilev","Vitebsk",null,null,null,null,null,null,null,null,null,null,null,null,null,null,null,null,null,null,null,null,null,null,null,null,null,null,null,null,"Water data, raw numbers (weighted)",null,"Poorest","Poor","Middle","Rich","Richest","Poorest","Poor","Middle","Rich","Richest","Poorest","Poor","Middle","Rich","Richest","Brest","Gomel","Grodno","Minsk","Minsk city","Mogilev","Vitebsk"]
["Main source of drinking water","Piped into dwelling",28.123228879048096,78.082844823584693,97.280763308164495,98.746884713655859,97.083587371150657,66.008473809156513,98.441829056705913,99.23607013486405,97.972437976515323,98.146722821478477,12.605247453149723,31.936762867622861,58.643723124523703,86.131331452007956,91.908069480993987,78.119658625301597,82.070335229398566,75.532788435025694,75.121164755036759,96.541623505881489,77.495807441499991,71.544135120671754]
[null,"Piped into yard or plot",7.3666344542476807,3.3329623078646211,4.7281391977700121E-2,3.2492109200935586E-2,9.4326325498913649E-2,3.1393736109987502,7.1435704286476331E-2,0,0,0.14272592341725265,8.6837823310454851,7.8181201980961168,6.0113620381548429,2.9495787276954961,9.6047349319877545E-2,5.0020442610342544,3.5731550946146537,2.0085142739989674,1.3700883981911032,0,2.568580134231345,0.84531160683781814]
[null,"Public tap/standpipe",17.151827610767825,6.1846166017935813,0.20061888653234294,4.1186686243683795E-2,0.17450110533651636,17.182102310727775,0.17026118160405587,0,0.14683566544428397,0.17875556268246098,15.343651481096662,10.612312408222222,7.7826277205529255,1.7279153482179166,0.12996846195772699,2.0641632044567331,5.0869498264079365,1.0965598853262621,5.3987539519703978,0.64191664579707441,12.009681956602005,8.1790596067938406]
[null,"Protected well",46.065873307769309,11.737706544873488,1.6531917668166454,0.62607436183739185,0.8995187728927404,12.754866937107101,0.55842383924191596,0.13840962485853317,0.15604883138169426,0.12741921392549729,61.665214121016341,48.308404424543092,26.774004979246985,9.0233312202067548,7.4766815098748625,14.814133909207476,8.8116281801874887,19.623327636026843,17.237478481866436,0,7.4375926741223521,18.825430614229791]
[null,"Unprotected well",1.0205045441219744,0.54092059724774677,0,0,0,0.74147643366127425,0,0,0,0,1.5770217127366153,0.98565766041444525,0.59889088273593372,0,0,0,0.18940230729029378,1.5914003945637054,0.3871246275975786,0,5.3532937968847984E-2,0.12731215690827319]
[null,"Bottled water",0,0.12094912463586287,0.78031953292666556,0.55336212906211579,1.7198848733275767,0,0.70090165473248667,0.62552024027739028,1.7246775266587313,1.3617347453235955,0,0,0.18939125478562385,0.16784325187179863,0.38923319785355126,0,0.23122676123584479,8.6663986545361171E-2,0.28601489851333994,2.8164598483215655,0.29984452900714981,0.43192777260987281]
[null,"Other",0.2719312040451598,0,3.7825113582160098E-2,0,2.8181551793645239E-2,0.17370689834848599,5.7148563429181065E-2,0,0,4.2641733172628184E-2,0.1250829009553758,0.33874244110114876,0,0,0,0,3.730260086510568E-2,6.0745388513439642E-2,0.19937488682418178,0,0.13496032656850077,4.6823121948477674E-2]
[]
[]
[]
[]
[]
[]
[]
[]
[]
[]
[]
[]
[]
[]
[]
[]
[]
[]
[]
[]
[]
[]
[]
[]
[]
[]
[]
[]
[]
[]
[]
[]
[]
[]
[]
[]
[]
[]
[]
[]
[]
[]
[]
[{"$f":"A1026","v":"Belarus"}]
[{"$f":"A1034","v":"2005"}]
["Use of sanitation facilities"]
[" by wealth quintile and sub-national region"]
["Notes:"]
["WHO/UNICEF JMP customised wealth index excludes water,"]
[" sanitation and hygiene assets."]
["Survey used for analysis:",{"$f":"A1025","v":"MICS05"}]
[{"$f":"B1030","v":""}]
[{"$f":"B1029","v":""}]
[]
[]
["Use of sanitation facilities",null,"NATIONAL wealth index quintile",null,null,null,null,"URBAN wealth index quintile",null,null,null,null,"RURAL wealth index quintile",null,null,null,null,"SUB-REGIONS:",null,null,null,null,null,null,null,null,null,null,null,null,null,null,null,null,null,null,null,null,null,null,null,null,null,null,null,null,null,null,null,null,null,null,"Raw numbers of respondents:","Use of sanitation facilities","NATIONAL wealth index quintile",null,null,null,null,"URBAN wealth index quintile",null,null,null,null,"RURAL wealth index quintile",null,null,null,null,"SUB-REGIONS:"]
["Weighted percentage (used in graphs)",null,"Poorest","Poor","Middle","Rich","Richest","Poorest","Poor","Middle","Rich","Richest","Poorest","Poor","Middle","Rich","Richest","Brest","Gomel","Grodno","Minsk","Minsk city","Mogilev","Vitebsk",null,null,null,null,null,null,null,null,null,null,null,null,null,null,null,null,null,null,null,null,null,null,null,null,null,null,null,null,"Sanitation data, raw numbers (weighted)",null,"Poorest","Poor","Middle","Rich","Richest","Poorest","Poor","Middle","Rich","Richest","Poorest","Poor","Middle","Rich","Richest","Brest","Gomel","Grodno","Minsk","Minsk city","Mogilev","Vitebsk"]
["Sanitation","Improved",98.239861359486994,98.651259593054718,99.801825638817519,100,100,97.834398290734342,99.874499663141961,100,100,100,98.512848825766426,97.987371646490146,99.653335793366409,98.894977045079415,99.659707455649865,99.946075681058687,99.903237324642831,99.009220434772345,99.854561098461232,100,99.930024121917896,96.493245134370639,null,null,null,null,null,null,null,null,null,null,null,null,null,null,null,null,null,null,null,null,null,null,null,null,null,null,null,null,"Sanitation","Improved",3519.8918975802776,3534.5361882168263,3578.1481335603253,3584.959556302113,3580.6087523721444,2319.3891263837218,2370.0055885743682,2361.6721609498081,2379.9859890976181,2366.3932842328168,1195.8014827640659,1187.9469840184677,1210.3580760321195,1197.953434283281,1208.6384016954778,2649.3733564096678,2702.478332598504,2210.3568724370352,2833.4564123318924,2849.0304062087312,2168.2621548168468,2385.1869932290065]
[null,"Not Improved",1.7601386405129944,1.3487404069452777,0.19817436118248519,0,0,2.165601709265661,0.12550033685801684,0,0,0,1.4871511742336105,2.0126283535099274,0.34666420663358188,1.105022954920557,0.34029254435013229,5.3924318941304221E-2,9.6762675357150219E-2,0.99077956522764499,0.14543890153878042,0,6.9975878082111365E-2,3.5067548656293677,null,null,null,null,null,null,null,null,null,null,null,null,null,null,null,null,null,null,null,null,null,null,null,null,null,null,null,null,null,"Not Improved",63.065008985391415,48.32347601564728,7.1050525984448392,0,0,51.340562668176403,2.9781025259166598,0,0,0,18.051833851522339,24.40003994726818,4.2104744294786958,13.385574104593063,4.1269500725281798,1.42942734761825,2.6175231209695591,22.118913889579282,4.1269500725281798,0,1.5183229417658199,86.682400227022427]
["Sanitation ladder","Basic",{"$f":"C122*C129/100","v":92.409178885559697},{"$f":"D122*D129/100","v":94.017411565517079},{"$f":"E122*E129/100","v":91.084748106366149},94.12108547501353,93.44143185284338,87.699167949627864,87.681663764369091,94.390082533445536,92.621106072560522,93.702600325432613,96.870802572480315,94.323572886468753,96.746490252223197,96.148837152551266,98.554923582790337,93.276639507743369,97.0976817220416,91.805373818974189,93.677450818611092,88.411869580643938,95.347386814438821,91.853683518717631,null,null,null,null,null,null,null,null,null,null,null,null,null,null,null,null,null,null,null,null,null,null,null,null,null,null,null,null,"Sanitation ladder","Basic",3310.9810571807857,3368.5119163363483,3265.618833588182,3374.2028482317778,3345.7720872647628,2079.1102116333141,2080.6715812138673,2229.1843018899303,2204.3693474741835,2217.3720412525549,1175.8694498581906,1143.5290287872549,1175.0524442788985,1164.6883705401867,1195.2399656735167,2472.5797566665101,2626.5853642626325,2049.5327410552322,2658.1757587534917,2518.8810470501539,2068.8289851526829,2270.5030896611456]
[null,"Limited",{"$f":"C122*C128/100","v":5.8306824739272365},{"$f":"D122*D128/100","v":4.633848027537657},{"$f":"E122*E128/100","v":8.7170775324514409},5.8789145249865786,6.5585681471567518,10.135230341106386,12.192835898772728,5.6099174665544247,7.3788939274395897,6.2973996745672416,1.6420462532861462,3.6637987600213564,2.9068455411432508,2.7461398925281784,1.1047838728595449,6.6694361733153196,2.8055556026012551,7.2038466157981444,6.1771102798500932,11.58813041935627,4.5826373074791249,4.639561615652946,null,null,null,null,null,null,null,null,null,null,null,null,null,null,null,null,null,null,null,null,null,null,null,null,null,null,null,null,null,"Limited",208.91084039948993,166.02427188047884,312.52929997214557,210.7567080703393,234.83666510738621,240.27891475040505,289.33400736049771,132.48785905987663,175.61664162343718,149.02124298025845,19.932032905875879,44.41795523121241,35.305631753221185,33.265063743094672,13.39843602196126,176.7935997431579,75.892968335872069,160.82413138180286,175.28065357839935,330.14935915858348,99.43316966416495,114.6839035678592]
[null,"Unimproved",{"$f":"100-C124-C125-C127","v":1.7601386405130661},{"$f":"100-D124-D125-D127","v":1.3487404069452635},{"$f":"100-E124-E125-E127","v":0.19817436118241005},-1.0835776720341528E-13,-1.3145040611561853E-13,2.1656017092657507,0.12550033685818107,3.907985046680551E-14,-1.1191048088221578E-13,1.4566126083082054E-13,1.4871511742335388,2.0126283535098906,0.34666420663355257,1.1050229549205555,0.34029254435011769,5.3924318941311888E-2,9.6762675357145334E-2,0.9907795652276663,0.14543890153881467,-2.078337502098293E-13,6.9975878082054521E-2,3.5067548656294232,null,null,null,null,null,null,null,null,null,null,null,null,null,null,null,null,null,null,null,null,null,null,null,null,null,null,null,null,null,"Unimproved",63.065008985391415,48.32347601564728,7.1050525984448392,0,0,51.340562668176403,2.9781025259166598,0,0,0,18.051833851522339,24.40003994726818,4.2104744294786958,13.385574104593063,4.1269500725281798,1.42942734761825,2.6175231209695591,22.118913889579282,4.1269500725281798,0,1.5183229417658199,86.682400227022427]
[null,"Open defecation",0,0,0,0,0,0,0,0,0,0,0,0,0,0,0,0,0,0,0,0,0,0,null,null,null,null,null,null,null,null,null,null,null,null,null,null,null,null,null,null,null,null,null,null,null,null,null,null,null,null,null,"Open defecation",192.26725818665824,1747.7209647549603,3394.619218016458,3546.892191263039,3580.6087523721444,794.06131313113269,2274.2206876238261,2344.7582824972742,2367.0459703182755,2366.3932842328168,2.3928394246073452,75.724537849947765,311.86781429982869,788.67445879822196,1136.9691964173649,1706.1488531595755,1778.5910454146599,1410.6107170320126,1719.5372419635623,2822.1625014376209,1360.3636485920963,1664.6943769937247]
["Shared among Improved Sanitation","Yes",5.935149330668481,4.6972010764512238,8.7343868477902564,5.8789145249865786,6.5585681471567518,10.359577529150368,12.208157177154215,5.6099174665544256,7.3788939274395897,6.2973996745672407,1.6668346036671131,3.7390519803299487,2.9169575890270898,2.7768244400081126,1.1085562069818347,6.6730345617554647,2.8082729626512486,7.2759350938876102,6.186107286335349,11.58813041935627,4.5858462936906301,4.8081724365184053,null,null,null,null,null,null,null,null,null,null,null,null,null,null,null,null,null,null,null,null,null,null,null,null,null,null,null,null,"Shared among improved sanitation facilities","Yes","N/A","N/A","N/A","N/A","N/A","N/A","N/A","N/A","N/A","N/A","N/A","N/A","N/A","N/A","N/A","N/A","N/A","N/A","N/A","N/A","N/A","N/A"]
[null,"No",94.064850669331463,95.302798923548806,91.265613152209809,94.12108547501353,93.44143185284338,89.640422470849529,87.791842822845652,94.390082533445536,92.621106072560522,93.702600325432613,98.33316539633293,96.260948019670025,97.083042410972936,97.223175559991915,98.891443793018183,93.326965438244542,97.19172703734877,92.724064906112375,93.8138927136646,88.411869580643952,95.41415370630942,95.191827563481525,null,null,null,null,null,null,null,null,null,null,null,null,null,null,null,null,null,null,null,null,null,null,null,null,null,null,null,null,null,"No","N/A","N/A","N/A","N/A","N/A","N/A","N/A","N/A","N/A","N/A","N/A","N/A","N/A","N/A","N/A","N/A","N/A","N/A","N/A","N/A","N/A","N/A"]
["Manually calculated ratios","Improved latrines"]
[null,"Other"]
[null,"Other"]
[null,null,"NATIONAL wealth index quintile",null,null,null,null,"URBAN wealth index quintile",null,null,null,null,"RURAL wealth index quintile",null,null,null,null,"SUB-REGIONS:",null,null,null,null,null,null,null,null,null,null,null,null,null,null,null,null,null,null,null,null,null,null,null,null,null,null,null,null,null,null,null,null,null,null,"Raw numbers of respondents:","Use of sanitation facilities","NATIONAL wealth index quintile",null,null,null,null,"URBAN wealth index quintile",null,null,null,null,"RURAL wealth index quintile",null,null,null,null,"SUB-REGIONS:"]
["Percentage based on weighted population",null,"Poorest","Poor","Middle","Rich","Richest","Poorest","Poor","Middle","Rich","Richest","Poorest","Poor","Middle","Rich","Richest","Brest","Gomel","Grodno","Minsk","Minsk city","Mogilev","Vitebsk",null,null,null,null,null,null,null,null,null,null,null,null,null,null,null,null,null,null,null,null,null,null,null,null,null,null,null,null,"Sanitation data, raw numbers (weighted)",null,"Poorest","Poor","Middle","Rich","Richest","Poorest","Poor","Middle","Rich","Richest","Poorest","Poor","Middle","Rich","Richest","Brest","Gomel","Grodno","Minsk","Minsk city","Mogilev","Vitebsk"]
["Sanitation type","Sewer connection",5.3661616145685089,48.780056394683271,94.682831079314738,98.938136834147699,100,33.494384315433848,95.838024346864941,99.283817680870172,99.456298531225855,100,0.1971275599657259,6.2461107548434081,25.677250920197377,65.107657999707214,93.75013845504877,64.363477494966844,65.74964956062928,63.185935797004802,60.598651117918735,99.05694566430185,62.695911523609738,67.345563701739223,null,null,null,null,null,null,null,null,null,null,null,null,null,null,null,null,null,null,null,null,null,null,null,null,null,null,null,null,"Sanitation type","Sewer connection","N/A","N/A","N/A","N/A","N/A","N/A","N/A","N/A","N/A","N/A","N/A","N/A","N/A","N/A","N/A","N/A","N/A","N/A","N/A","N/A","N/A","N/A"]
[null,"Septic tank connection",2.9576756108918243,8.1892923508944939,2.2582651297223948,1.0240542635771113,0,5.936527458666979,1.3095780954281431,0.71618231912980757,0.54370146877414949,0,0.44966779639696491,2.9638029885515467,10.677768627764086,8.2600890824574247,3.6490300617248206,5.2561797635872569,0.99151711094837158,1.9846467488737813,4.9523016136836757,0,4.4223706719236233,2.8366757913497165,null,null,null,null,null,null,null,null,null,null,null,null,null,null,null,null,null,null,null,null,null,null,null,null,null,null,null,null,null,"Septic tank connection","N/A","N/A","N/A","N/A","N/A","N/A","N/A","N/A","N/A","N/A","N/A","N/A","N/A","N/A","N/A","N/A","N/A","N/A","N/A","N/A","N/A","N/A"]
[null,"Improved latrines",89.916024134026557,41.681910847477042,2.860729429780422,3.7808902275167339E-2,0,58.403486516633272,2.7268972208487781,0,0,0,97.866053469403766,88.777457903095154,63.298316245404976,25.5272299629146,2.2605389388762864,30.326418422504769,33.162070653065101,33.838637888894276,34.303608366858782,0.94305433569817165,32.81174192638462,26.311005641281408,null,null,null,null,null,null,null,null,null,null,null,null,null,null,null,null,null,null,null,null,null,null,null,null,null,null,null,null,null,"Improved latrines","N/A","N/A","N/A","N/A","N/A","N/A","N/A","N/A","N/A","N/A","N/A","N/A","N/A","N/A","N/A","N/A","N/A","N/A","N/A","N/A","N/A","N/A"]
[null,"Unimproved facilities",1.7601386405129944,1.3487404069452777,0.19817436118248519,0,0,2.165601709265661,0.12550033685801684,0,0,0,1.4871511742336105,2.0126283535099274,0.34666420663358188,1.105022954920557,0.34029254435013229,5.3924318941304221E-2,9.6762675357150219E-2,0.99077956522764499,0.14543890153878042,0,6.9975878082111365E-2,3.5067548656293677,null,null,null,null,null,null,null,null,null,null,null,null,null,null,null,null,null,null,null,null,null,null,null,null,null,null,null,null,null,"Unimproved facilities","N/A","N/A","N/A","N/A","N/A","N/A","N/A","N/A","N/A","N/A","N/A","N/A","N/A","N/A","N/A","N/A","N/A","N/A","N/A","N/A","N/A","N/A"]
[null,"Open defecation",0,0,0,0,0,0,0,0,0,0,0,0,0,0,0,0,0,0,0,0,0,0,null,null,null,null,null,null,null,null,null,null,null,null,null,null,null,null,null,null,null,null,null,null,null,null,null,null,null,null,null,"Open defecation","N/A","N/A","N/A","N/A","N/A","N/A","N/A","N/A","N/A","N/A","N/A","N/A","N/A","N/A","N/A","N/A","N/A","N/A","N/A","N/A","N/A","N/A"]
["Septic tank emptying practices","Not emptied/treated and disposed in situ","N/A","N/A","N/A","N/A","N/A","N/A","N/A","N/A","N/A","N/A","N/A","N/A","N/A","N/A","N/A","N/A","N/A","N/A","N/A","N/A","N/A","N/A",null,null,null,null,null,null,null,null,null,null,null,null,null,null,null,null,null,null,null,null,null,null,null,null,null,null,null,null,"Septic tank emptying practices","Not emptied/treated and disposed in situ","N/A","N/A","N/A","N/A","N/A","N/A","N/A","N/A","N/A","N/A","N/A","N/A","N/A","N/A","N/A","N/A","N/A","N/A","N/A","N/A","N/A","N/A"]
[null,"Emptied and buried on site","N/A","N/A","N/A","N/A","N/A","N/A","N/A","N/A","N/A","N/A","N/A","N/A","N/A","N/A","N/A","N/A","N/A","N/A","N/A","N/A","N/A","N/A",null,null,null,null,null,null,null,null,null,null,null,null,null,null,null,null,null,null,null,null,null,null,null,null,null,null,null,null,null,"Emptied and buried on site","N/A","N/A","N/A","N/A","N/A","N/A","N/A","N/A","N/A","N/A","N/A","N/A","N/A","N/A","N/A","N/A","N/A","N/A","N/A","N/A","N/A","N/A"]
[null,"Emptied and discharged locally","N/A","N/A","N/A","N/A","N/A","N/A","N/A","N/A","N/A","N/A","N/A","N/A","N/A","N/A","N/A","N/A","N/A","N/A","N/A","N/A","N/A","N/A",null,null,null,null,null,null,null,null,null,null,null,null,null,null,null,null,null,null,null,null,null,null,null,null,null,null,null,null,null,"Emptied and discharged locally","N/A","N/A","N/A","N/A","N/A","N/A","N/A","N/A","N/A","N/A","N/A","N/A","N/A","N/A","N/A","N/A","N/A","N/A","N/A","N/A","N/A","N/A"]
[null,"Emptied and removed offsite","N/A","N/A","N/A","N/A","N/A","N/A","N/A","N/A","N/A","N/A","N/A","N/A","N/A","N/A","N/A","N/A","N/A","N/A","N/A","N/A","N/A","N/A",null,null,null,null,null,null,null,null,null,null,null,null,null,null,null,null,null,null,null,null,null,null,null,null,null,null,null,null,null,"Emptied and removed offsite","N/A","N/A","N/A","N/A","N/A","N/A","N/A","N/A","N/A","N/A","N/A","N/A","N/A","N/A","N/A","N/A","N/A","N/A","N/A","N/A","N/A","N/A"]
["Latrine emptying practices","Not emptied/treated and disposed in situ","N/A","N/A","N/A","N/A","N/A","N/A","N/A","N/A","N/A","N/A","N/A","N/A","N/A","N/A","N/A","N/A","N/A","N/A","N/A","N/A","N/A","N/A",null,null,null,null,null,null,null,null,null,null,null,null,null,null,null,null,null,null,null,null,null,null,null,null,null,null,null,null,"Latrine emptying practices","Not emptied/treated and disposed in situ","N/A","N/A","N/A","N/A","N/A","N/A","N/A","N/A","N/A","N/A","N/A","N/A","N/A","N/A","N/A","N/A","N/A","N/A","N/A","N/A","N/A","N/A"]
[null,"Emptied and buried on site","N/A","N/A","N/A","N/A","N/A","N/A","N/A","N/A","N/A","N/A","N/A","N/A","N/A","N/A","N/A","N/A","N/A","N/A","N/A","N/A","N/A","N/A",null,null,null,null,null,null,null,null,null,null,null,null,null,null,null,null,null,null,null,null,null,null,null,null,null,null,null,null,null,"Emptied and buried on site","N/A","N/A","N/A","N/A","N/A","N/A","N/A","N/A","N/A","N/A","N/A","N/A","N/A","N/A","N/A","N/A","N/A","N/A","N/A","N/A","N/A","N/A"]
[null,"Emptied and discharged locally","N/A","N/A","N/A","N/A","N/A","N/A","N/A","N/A","N/A","N/A","N/A","N/A","N/A","N/A","N/A","N/A","N/A","N/A","N/A","N/A","N/A","N/A",null,null,null,null,null,null,null,null,null,null,null,null,null,null,null,null,null,null,null,null,null,null,null,null,null,null,null,null,null,"Emptied and discharged locally","N/A","N/A","N/A","N/A","N/A","N/A","N/A","N/A","N/A","N/A","N/A","N/A","N/A","N/A","N/A","N/A","N/A","N/A","N/A","N/A","N/A","N/A"]
[null,"Emptied and removed offsite","N/A","N/A","N/A","N/A","N/A","N/A","N/A","N/A","N/A","N/A","N/A","N/A","N/A","N/A","N/A","N/A","N/A","N/A","N/A","N/A","N/A","N/A",null,null,null,null,null,null,null,null,null,null,null,null,null,null,null,null,null,null,null,null,null,null,null,null,null,null,null,null,null,"Emptied and removed offsite","N/A","N/A","N/A","N/A","N/A","N/A","N/A","N/A","N/A","N/A","N/A","N/A","N/A","N/A","N/A","N/A","N/A","N/A","N/A","N/A","N/A","N/A"]
["Shared among improved sanitation facilities","Yes",5.8306824739272356,4.6338480275376579,8.7170775324514409,5.8789145249865786,6.5585681471567518,10.135230341106386,12.192835898772728,5.6099174665544256,7.3788939274395897,6.2973996745672407,1.642046253286146,3.6637987600213564,2.9068455411432508,2.7461398925281779,1.1047838728595449,6.6694361733153187,2.8055556026012551,7.2038466157981453,6.1771102798500923,11.58813041935627,4.582637307479124,4.639561615652946,null,null,null,null,null,null,null,null,null,null,null,null,null,null,null,null,null,null,null,null,null,null,null,null,null,null,null,null,"Shared among improved sanitation facilities","Yes","N/A","N/A","N/A","N/A","N/A","N/A","N/A","N/A","N/A","N/A","N/A","N/A","N/A","N/A","N/A","N/A","N/A","N/A","N/A","N/A","N/A","N/A"]
[null,"No",92.409178885559697,94.017411565517079,91.084748106366149,94.12108547501353,93.44143185284338,87.699167949627835,87.681663764369105,94.390082533445536,92.621106072560522,93.702600325432613,96.870802572480329,94.323572886468767,96.746490252223168,96.148837152551266,98.554923582790337,93.276639507743369,97.0976817220416,91.805373818974203,93.677450818611092,88.411869580643952,95.347386814438821,91.853683518717617,null,null,null,null,null,null,null,null,null,null,null,null,null,null,null,null,null,null,null,null,null,null,null,null,null,null,null,null,null,"No","N/A","N/A","N/A","N/A","N/A","N/A","N/A","N/A","N/A","N/A","N/A","N/A","N/A","N/A","N/A","N/A","N/A","N/A","N/A","N/A","N/A","N/A"]
[null,"DK/missing",1.7601386405129944,1.3487404069452777,0.19817436118248519,0,0,2.165601709265661,0.12550033685801684,0,0,0,1.4871511742336105,2.0126283535099274,0.34666420663358188,1.105022954920557,0.34029254435013229,5.3924318941304221E-2,9.6762675357150219E-2,0.99077956522764499,0.14543890153878042,0,6.9975878082111365E-2,3.5067548656293677,null,null,null,null,null,null,null,null,null,null,null,null,null,null,null,null,null,null,null,null,null,null,null,null,null,null,null,null,null,"DK/missing","N/A","N/A","N/A","N/A","N/A","N/A","N/A","N/A","N/A","N/A","N/A","N/A","N/A","N/A","N/A","N/A","N/A","N/A","N/A","N/A","N/A","N/A"]
["Shared among all sanitation facilities","Yes",6.0375065621747934,4.7596562606572901,8.7170775324514409,5.8789145249865786,6.5585681471567518,10.438827375602804,12.192835898772728,5.6099174665544256,7.3788939274395897,6.2973996745672407,1.9013024745846652,3.7935879284093863,2.9068455411432508,2.7461398925281779,1.1047838728595449,6.6694361733153187,2.8055556026012551,7.3928458663975762,6.1771102798500923,11.58813041935627,4.582637307479124,4.9510096196390876,null,null,null,null,null,null,null,null,null,null,null,null,null,null,null,null,null,null,null,null,null,null,null,null,null,null,null,null,"Shared among all sanitation facilities","Yes","N/A","N/A","N/A","N/A","N/A","N/A","N/A","N/A","N/A","N/A","N/A","N/A","N/A","N/A","N/A","N/A","N/A","N/A","N/A","N/A","N/A","N/A"]
[null,"No",93.962493437825174,95.240343739342777,91.28292246754863,94.12108547501353,93.44143185284338,89.561172624397059,87.807164101227116,94.390082533445536,92.621106072560522,93.702600325432613,98.098697525415375,96.206412071590648,97.093154458856745,97.253860107471795,98.895216127140472,93.330563826684681,97.194444397398755,92.607154133602407,93.82288972014986,88.411869580643952,95.417362692520925,95.048990380360877,null,null,null,null,null,null,null,null,null,null,null,null,null,null,null,null,null,null,null,null,null,null,null,null,null,null,null,null,null,"No","N/A","N/A","N/A","N/A","N/A","N/A","N/A","N/A","N/A","N/A","N/A","N/A","N/A","N/A","N/A","N/A","N/A","N/A","N/A","N/A","N/A","N/A"]
["Kind of toilet facility","Flush to piped sewer system",5.3661616145685089,48.780056394683271,94.682831079314738,98.938136834147699,100,33.494384315433848,95.838024346864941,99.283817680870172,99.456298531225855,100,0.1971275599657259,6.2461107548434081,25.677250920197377,65.107657999707214,93.75013845504877,64.363477494966844,65.74964956062928,63.185935797004802,60.598651117918735,99.05694566430185,62.695911523609738,67.345563701739223,null,null,null,null,null,null,null,null,null,null,null,null,null,null,null,null,null,null,null,null,null,null,null,null,null,null,null,null,"Kind of toilet facility","Flush to piped sewer system",192.26725818665824,1747.7209647549603,3394.619218016458,3546.892191263039,3580.6087523721444,794.06131313113269,2274.2206876238261,2344.7582824972742,2367.0459703182755,2366.3932842328168,2.3928394246073452,75.724537849947765,311.86781429982869,788.67445879822196,1136.9691964173649,1706.1488531595755,1778.5910454146599,1410.6107170320126,1719.5372419635623,2822.1625014376209,1360.3636485920963,1664.6943769937247]
[null,"Flush to septic tank",2.9576756108918243,8.1892923508944939,2.2582651297223948,1.0240542635771113,0,5.936527458666979,1.3095780954281431,0.71618231912980757,0.54370146877414949,0,0.44966779639696491,2.9638029885515467,10.677768627764086,8.2600890824574247,3.6490300617248206,5.2561797635872569,0.99151711094837158,1.9846467488737813,4.9523016136836757,0,4.4223706719236233,2.8366757913497165,null,null,null,null,null,null,null,null,null,null,null,null,null,null,null,null,null,null,null,null,null,null,null,null,null,null,null,null,null,"Flush to septic tank",105.97224257425698,293.41085242627418,80.964522515284642,36.711931183826877,0,140.73901896133623,31.076074626731568,16.913878452533378,12.94001877934272,0,5.4583074603167869,35.931577327912187,129.68881964387757,100.05768118339485,44.254172264197308,139.33095949245816,26.821488277013859,44.306758112725539,140.52568664597362,0,95.955735493521161,70.118920677950243]
[null,"Flush to pit (latrine)",1.7267562649645487,4.2852759386192867,0.45890588699849832,0,0,7.5543535832468365,0.65644724733612447,0,0,0,0,0.41156472549273815,0.85557735200694296,1.5763193107643423,0.22352780004318992,0,4.6340868000686797,1.1382651373802655,1.5569095746413801,0.88163586059235599,0.2044315459813873,0.29762550509725572,null,null,null,null,null,null,null,null,null,null,null,null,null,null,null,null,null,null,null,null,null,null,null,null,null,null,null,null,null,"Flush to pit (latrine)",61.868932855102692,153.53542310584996,16.452937935083828,0,0,179.09330321398866,15.577386119962984,0,0,0,0,4.9895927012039571,10.391573442348454,19.09457070803936,2.7108677104930772,0,125.35648997910104,25.4114935762118,44.178607057705229,25.118073740316241,4.4357157750842626,7.3569137676179768]
[null,"Ventilated Improved Pit latrine (VIP)",0.72418315031113478,1.1250950597658571,9.5819696255157599E-2,0,0,2.0123685929607422,0.10795510277550983,0,0,0,0.22665836231540509,0.22888577195659682,0.86090778856820427,0.21194912697880061,7.2035511989908152E-2,0,0.41631665240321841,0.34987373165316632,9.6959267692520293E-2,0,6.4984448486389429E-2,1.8795165852588656,null,null,null,null,null,null,null,null,null,null,null,null,null,null,null,null,null,null,null,null,null,null,null,null,null,null,null,null,null,"Ventilated Improved Pit latrine (VIP)",25.947170200257649,40.31057708062314,3.4353787129556936,0,0,47.707819686476263,2.5617569825733999,0,0,0,2.7513000483521202,2.7748898445968,10.45631524842384,2.5674224530317602,0.87362173038229374,0,11.26176451082951,7.8108463418742939,2.7513000483521202,0,1.41001987683678,46.45919521594378]
[null,"Pit latrine with slab",87.34990191917646,36.271539849091958,2.3060038465267656,3.7808902275167339E-2,0,48.836764340425674,1.9624948707371432,0,0,0,97.639395107088362,87.796597441258839,61.58183110482981,23.738961525171447,1.9649756268431882,30.326418422504769,28.111667200593228,32.350499019860827,32.504300622986086,6.1418475105815724E-2,32.542325931916842,24.133863550925273,null,null,null,null,null,null,null,null,null,null,null,null,null,null,null,null,null,null,null,null,null,null,null,null,null,null,null,null,null,"Pit latrine with slab",3129.7093436914711,1299.558370849124,82.676076380544657,1.3554338552465386,0,1157.787671390782,46.569683221272037,0,0,0,1185.1990358307901,1064.3994362222782,747.95355339764114,287.55930114059083,23.830543573040373,803.89354375763889,760.44754441689804,722.21705737422178,922.33662654376951,1.74983103079443,706.0970350793101,596.55758657376214]
[null,"Pit latrine without slab/open pit",1.6380970791025895,1.3487404069452777,0.19817436118248519,0,0,2.1115728380197392,0.12550033685801684,0,0,0,1.3620682732782345,1.8828391851218977,0.34666420663358188,1.105022954920557,0.34029254435013229,5.3924318941304221E-2,4.9412098534576766E-2,0.99077956522764499,0.14543890153878042,0,0,3.4430987871752308,null,null,null,null,null,null,null,null,null,null,null,null,null,null,null,null,null,null,null,null,null,null,null,null,null,null,null,null,null,"Pit latrine without slab/open pit",58.692312431956736,48.32347601564728,7.1050525984448392,0,0,50.059684176889704,2.9781025259166598,0,0,0,16.533510909756519,22.826544826886021,4.2104744294786958,13.385574104593063,4.1269500725281798,1.42942734761825,1.3366446296828591,22.118913889579282,4.1269500725281798,0,0,85.10890510664025]
[null,"Composting toilet",0.11518279957444248,0,0,0,0,0,0,0,0,0,0,0.3404099643869643,0,0,0,0,0,0,0.14543890153878042,0,0,0,null,null,null,null,null,null,null,null,null,null,null,null,null,null,null,null,null,null,null,null,null,null,null,null,null,null,null,null,null,"Composting toilet",4.1269500725281798,0,0,0,0,0,0,0,0,0,0,4.1269500725281798,0,0,0,0,0,0,4.1269500725281798,0,0,0]
[null,"Bucket",0.12204156141040476,0,0,0,0,5.4028871245922115E-2,0,0,0,0,0.1250829009553758,0.12978916838803015,0,0,0,0,4.7350576822573445E-2,0,0,0,6.9975878082111365E-2,6.3656078454136594E-2,null,null,null,null,null,null,null,null,null,null,null,null,null,null,null,null,null,null,null,null,null,null,null,null,null,null,null,null,null,"Bucket",4.3726965534346807,0,0,0,0,1.2808784912866999,0,0,0,0,1.5183229417658199,1.5734951203821601,0,0,0,0,1.2808784912866999,0,0,0,1.5183229417658199,1.5734951203821601]
[null,null,null,null,null,null,null,null,null,null,null,null,null,null,null,null,null,null,null,null,null,null,null,null,null,null,null,null,null,null,null,null,null,null,null,null,null,null,null,null,null,null,null,null,null,null,null,null,null,null,null,null,null,"Total",3582.9569065656697,3582.8596642324737,3585.2531861587699,3584.959556302113,3580.6087523721444,2370.7296890518983,2372.9836911002853,2361.6721609498081,2379.9859890976181,2366.3932842328168,1213.8533166155878,1212.3470239657349,1214.5685504615983,1211.3390083878744,1212.765351768006,2650.8027837572863,2705.095855719474,2232.4757863266145,2837.5833624044203,2849.0304062087312,2169.7804777586125,2471.8693934560288]
[]
[]
[]
[]
[]
[]
[]
[]
[]
[]
[]
[]
[]
[]
[]
[]
[]
[]
[]
[]
[]
[]
[]
[]
[]
[]
[]
[]
[]
[]
[]
[]
[]
[]
[]
[]
[]
[]
[]
[]
[]
[]
[]
[]
[]
[]
[{"$f":"A1026","v":"Belarus"}]
[{"$f":"A1034","v":"2005"}]
["Access to hygiene facilities "]
[" by wealth quintile and sub-national region"]
["Notes:"]
["WHO/UNICEF JMP customised wealth index excludes water,"]
[" sanitation and hygiene assets."]
["Survey used for analysis:",{"$f":"A1025","v":"MICS05"}]
[]
[]
[]
[]
["Access to handwashing",null,"NATIONAL wealth index quintile",null,null,null,null,"URBAN wealth index quintile",null,null,null,null,"RURAL wealth index quintile",null,null,null,null,"SUB-REGIONS:",null,null,null,null,null,null,null,null,null,null,null,null,null,null,null,null,null,null,null,null,null,null,null,null,null,null,null,null,null,null,null,null,null,null,"Raw numbers of respondents:","Access to handwashing","NATIONAL wealth index quintile",null,null,null,null,"URBAN wealth index quintile",null,null,null,null,"RURAL wealth index quintile",null,null,null,null,"SUB-REGIONS:"]
["Weighted percentage (used in graphs)",null,"Poorest","Poor","Middle","Rich","Richest","Poorest","Poor","Middle","Rich","Richest","Poorest","Poor","Middle","Rich","Richest","Brest","Gomel","Grodno","Minsk","Minsk city","Mogilev","Vitebsk",null,null,null,null,null,null,null,null,null,null,null,null,null,null,null,null,null,null,null,null,null,null,null,null,null,null,null,null,"Hygiene data, raw numbers (weighted)",null,"Poorest","Poor","Middle","Rich","Richest","Poorest","Poor","Middle","Rich","Richest","Poorest","Poor","Middle","Rich","Richest","Brest","Gomel","Grodno","Minsk","Minsk city","Mogilev","Vitebsk"]
["Hygiene ladder","Basic","N/A","N/A","N/A","N/A","N/A","N/A","N/A","N/A","N/A","N/A","N/A","N/A","N/A","N/A","N/A","N/A","N/A","N/A","N/A","N/A","N/A","N/A",null,null,null,null,null,null,null,null,null,null,null,null,null,null,null,null,null,null,null,null,null,null,null,null,null,null,null,null,"Hygiene ladder","Basic","N/A","N/A","N/A","N/A","N/A","N/A","N/A","N/A","N/A","N/A","N/A","N/A","N/A","N/A","N/A","N/A","N/A","N/A","N/A","N/A","N/A","N/A"]
[null,"Limited","N/A","N/A","N/A","N/A","N/A","N/A","N/A","N/A","N/A","N/A","N/A","N/A","N/A","N/A","N/A","N/A","N/A","N/A","N/A","N/A","N/A","N/A",null,null,null,null,null,null,null,null,null,null,null,null,null,null,null,null,null,null,null,null,null,null,null,null,null,null,null,null,null,"Limited","N/A","N/A","N/A","N/A","N/A","N/A","N/A","N/A","N/A","N/A","N/A","N/A","N/A","N/A","N/A","N/A","N/A","N/A","N/A","N/A","N/A","N/A"]
[null,"No facility","N/A","N/A","N/A","N/A","N/A","N/A","N/A","N/A","N/A","N/A","N/A","N/A","N/A","N/A","N/A","N/A","N/A","N/A","N/A","N/A","N/A","N/A",null,null,null,null,null,null,null,null,null,null,null,null,null,null,null,null,null,null,null,null,null,null,null,null,null,null,null,null,null,"No facility","N/A","N/A","N/A","N/A","N/A","N/A","N/A","N/A","N/A","N/A","N/A","N/A","N/A","N/A","N/A","N/A","N/A","N/A","N/A","N/A","N/A","N/A"]
[null,null,null,null,null,null,null,null,null,null,null,null,null,null,null,null,null,null,null,null,null,null,null,null,null,null,null,null,null,null,null,null,null,null,null,null,null,null,null,null,null,null,null,null,null,null,null,null,null,null,null,null,"Observed handwashing place","Fixed","N/A","N/A","N/A","N/A","N/A","N/A","N/A","N/A","N/A","N/A","N/A","N/A","N/A","N/A","N/A","N/A","N/A","N/A","N/A","N/A","N/A","N/A"]
[null,null,null,null,null,null,null,null,null,null,null,null,null,null,null,null,null,null,null,null,null,null,null,null,null,null,null,null,null,null,null,null,null,null,null,null,null,null,null,null,null,null,null,null,null,null,null,null,null,null,null,null,null,"Mobile","N/A","N/A","N/A","N/A","N/A","N/A","N/A","N/A","N/A","N/A","N/A","N/A","N/A","N/A","N/A","N/A","N/A","N/A","N/A","N/A","N/A","N/A"]
[null,null,null,null,null,null,null,null,null,null,null,null,null,null,null,null,null,null,null,null,null,null,null,null,null,null,null,null,null,null,null,null,null,null,null,null,null,null,null,null,null,null,null,null,null,null,null,null,null,null,null,null,"Water / Soap","Water and soap","N/A","N/A","N/A","N/A","N/A","N/A","N/A","N/A","N/A","N/A","N/A","N/A","N/A","N/A","N/A","N/A","N/A","N/A","N/A","N/A","N/A","N/A"]
[null,null,null,null,null,null,null,null,null,null,null,null,null,null,null,null,null,null,null,null,null,null,null,null,null,null,null,null,null,null,null,null,null,null,null,null,null,null,null,null,null,null,null,null,null,null,null,null,null,null,null,null,null,"Water only","N/A","N/A","N/A","N/A","N/A","N/A","N/A","N/A","N/A","N/A","N/A","N/A","N/A","N/A","N/A","N/A","N/A","N/A","N/A","N/A","N/A","N/A"]
[null,null,null,null,null,null,null,null,null,null,null,null,null,null,null,null,null,null,null,null,null,null,null,null,null,null,null,null,null,null,null,null,null,null,null,null,null,null,null,null,null,null,null,null,null,null,null,null,null,null,null,null,null,"Soap only","N/A","N/A","N/A","N/A","N/A","N/A","N/A","N/A","N/A","N/A","N/A","N/A","N/A","N/A","N/A","N/A","N/A","N/A","N/A","N/A","N/A","N/A"]
[null,null,null,null,null,null,null,null,null,null,null,null,null,null,null,null,null,null,null,null,null,null,null,null,null,null,null,null,null,null,null,null,null,null,null,null,null,null,null,null,null,null,null,null,null,null,null,null,null,null,null,null,null,"Neither","N/A","N/A","N/A","N/A","N/A","N/A","N/A","N/A","N/A","N/A","N/A","N/A","N/A","N/A","N/A","N/A","N/A","N/A","N/A","N/A","N/A","N/A"]
[]
[]
[]
[]
[]
[]
[]
[]
[]
[]
[]
[]
[]
[]
[]
[]
[]
[]
[]
[]
[]
[]
[]
[]
[]
[]
[]
[]
[null,null,null,null,null,null,null,null,null,null,null,null,null,null,null,null,null,null,null,null,null,null,null,null,null,null,null,null,null,null,null,null,null,null,null,null,null,null,null,null,null,null,null,null,null,null,null,null,null,null,null,null,"Raw numbers of respondents:","Menstrual health and hygiene","NATIONAL wealth index quintile",null,null,null,null,"URBAN wealth index quintile",null,null,null,null,"RURAL wealth index quintile",null,null,null,null,"SUB-REGIONS:"]
[null,null,null,null,null,null,null,null,null,null,null,null,null,null,null,null,null,null,null,null,null,null,null,null,null,null,null,null,null,null,null,null,null,null,null,null,null,null,null,null,null,null,null,null,null,null,null,null,null,null,null,null,"MHH data, raw numbers (weighted)",null,"Poorest","Poor","Middle","Rich","Richest","Poorest","Poor","Middle","Rich","Richest","Poorest","Poor","Middle","Rich","Richest","Brest","Gomel","Grodno","Minsk","Minsk city","Mogilev","Vitebsk"]
[null,null,null,null,null,null,null,null,null,null,null,null,null,null,null,null,null,null,null,null,null,null,null,null,null,null,null,null,null,null,null,null,null,null,null,null,null,null,null,null,null,null,null,null,null,null,null,null,null,null,null,null,"Private place to wash and change","Yes","N/A","N/A","N/A","N/A","N/A","N/A","N/A","N/A","N/A","N/A","N/A","N/A","N/A","N/A","N/A","N/A","N/A","N/A","N/A","N/A","N/A","N/A"]
[null,null,null,null,null,null,null,null,null,null,null,null,null,null,null,null,null,null,null,null,null,null,null,null,null,null,null,null,null,null,null,null,null,null,null,null,null,null,null,null,null,null,null,null,null,null,null,null,null,null,null,null,null,"No","N/A","N/A","N/A","N/A","N/A","N/A","N/A","N/A","N/A","N/A","N/A","N/A","N/A","N/A","N/A","N/A","N/A","N/A","N/A","N/A","N/A","N/A"]
[null,null,null,null,null,null,null,null,null,null,null,null,null,null,null,null,null,null,null,null,null,null,null,null,null,null,null,null,null,null,null,null,null,null,null,null,null,null,null,null,null,null,null,null,null,null,null,null,null,null,null,null,null,"DK/not sure/missing","N/A","N/A","N/A","N/A","N/A","N/A","N/A","N/A","N/A","N/A","N/A","N/A","N/A","N/A","N/A","N/A","N/A","N/A","N/A","N/A","N/A","N/A"]
[null,null,null,null,null,null,null,null,null,null,null,null,null,null,null,null,null,null,null,null,null,null,null,null,null,null,null,null,null,null,null,null,null,null,null,null,null,null,null,null,null,null,null,null,null,null,null,null,null,null,null,null,"Use of menstrual materials","Materials reusable","N/A","N/A","N/A","N/A","N/A","N/A","N/A","N/A","N/A","N/A","N/A","N/A","N/A","N/A","N/A","N/A","N/A","N/A","N/A","N/A","N/A","N/A"]
[null,null,null,null,null,null,null,null,null,null,null,null,null,null,null,null,null,null,null,null,null,null,null,null,null,null,null,null,null,null,null,null,null,null,null,null,null,null,null,null,null,null,null,null,null,null,null,null,null,null,null,null,null,"Materials not reusable","N/A","N/A","N/A","N/A","N/A","N/A","N/A","N/A","N/A","N/A","N/A","N/A","N/A","N/A","N/A","N/A","N/A","N/A","N/A","N/A","N/A","N/A"]
[null,null,null,null,null,null,null,null,null,null,null,null,null,null,null,null,null,null,null,null,null,null,null,null,null,null,null,null,null,null,null,null,null,null,null,null,null,null,null,null,null,null,null,null,null,null,null,null,null,null,null,null,null,"No materials used","N/A","N/A","N/A","N/A","N/A","N/A","N/A","N/A","N/A","N/A","N/A","N/A","N/A","N/A","N/A","N/A","N/A","N/A","N/A","N/A","N/A","N/A"]
[null,null,null,null,null,null,null,null,null,null,null,null,null,null,null,null,null,null,null,null,null,null,null,null,null,null,null,null,null,null,null,null,null,null,null,null,null,null,null,null,null,null,null,null,null,null,null,null,null,null,null,null,null,"DK/not sure/missing","N/A","N/A","N/A","N/A","N/A","N/A","N/A","N/A","N/A","N/A","N/A","N/A","N/A","N/A","N/A","N/A","N/A","N/A","N/A","N/A","N/A","N/A"]
[null,null,null,null,null,null,null,null,null,null,null,null,null,null,null,null,null,null,null,null,null,null,null,null,null,null,null,null,null,null,null,null,null,null,null,null,null,null,null,null,null,null,null,null,null,null,null,null,null,null,null,null,"Use of menstrual materials with private place to wash and change","Materials reusable","N/A","N/A","N/A","N/A","N/A","N/A","N/A","N/A","N/A","N/A","N/A","N/A","N/A","N/A","N/A","N/A","N/A","N/A","N/A","N/A","N/A","N/A"]
[null,null,null,null,null,null,null,null,null,null,null,null,null,null,null,null,null,null,null,null,null,null,null,null,null,null,null,null,null,null,null,null,null,null,null,null,null,null,null,null,null,null,null,null,null,null,null,null,null,null,null,null,null,"Materials not reusable","N/A","N/A","N/A","N/A","N/A","N/A","N/A","N/A","N/A","N/A","N/A","N/A","N/A","N/A","N/A","N/A","N/A","N/A","N/A","N/A","N/A","N/A"]
[null,null,null,null,null,null,null,null,null,null,null,null,null,null,null,null,null,null,null,null,null,null,null,null,null,null,null,null,null,null,null,null,null,null,null,null,null,null,null,null,null,null,null,null,null,null,null,null,null,null,null,null,null,"No materials used","N/A","N/A","N/A","N/A","N/A","N/A","N/A","N/A","N/A","N/A","N/A","N/A","N/A","N/A","N/A","N/A","N/A","N/A","N/A","N/A","N/A","N/A"]
[null,null,null,null,null,null,null,null,null,null,null,null,null,null,null,null,null,null,null,null,null,null,null,null,null,null,null,null,null,null,null,null,null,null,null,null,null,null,null,null,null,null,null,null,null,null,null,null,null,null,null,null,"Awareness of menstruation before menarche","Yes","N/A","N/A","N/A","N/A","N/A","N/A","N/A","N/A","N/A","N/A","N/A","N/A","N/A","N/A","N/A","N/A","N/A","N/A","N/A","N/A","N/A","N/A"]
[null,null,null,null,null,null,null,null,null,null,null,null,null,null,null,null,null,null,null,null,null,null,null,null,null,null,null,null,null,null,null,null,null,null,null,null,null,null,null,null,null,null,null,null,null,null,null,null,null,null,null,null,null,"No","N/A","N/A","N/A","N/A","N/A","N/A","N/A","N/A","N/A","N/A","N/A","N/A","N/A","N/A","N/A","N/A","N/A","N/A","N/A","N/A","N/A","N/A"]
[null,null,null,null,null,null,null,null,null,null,null,null,null,null,null,null,null,null,null,null,null,null,null,null,null,null,null,null,null,null,null,null,null,null,null,null,null,null,null,null,null,null,null,null,null,null,null,null,null,null,null,null,null,"DK/not sure/missing","N/A","N/A","N/A","N/A","N/A","N/A","N/A","N/A","N/A","N/A","N/A","N/A","N/A","N/A","N/A","N/A","N/A","N/A","N/A","N/A","N/A","N/A"]
[null,null,null,null,null,null,null,null,null,null,null,null,null,null,null,null,null,null,null,null,null,null,null,null,null,null,null,null,null,null,null,null,null,null,null,null,null,null,null,null,null,null,null,null,null,null,null,null,null,null,null,null,"Participation in (all) activities during menstruation","Yes","N/A","N/A","N/A","N/A","N/A","N/A","N/A","N/A","N/A","N/A","N/A","N/A","N/A","N/A","N/A","N/A","N/A","N/A","N/A","N/A","N/A","N/A"]
[null,null,null,null,null,null,null,null,null,null,null,null,null,null,null,null,null,null,null,null,null,null,null,null,null,null,null,null,null,null,null,null,null,null,null,null,null,null,null,null,null,null,null,null,null,null,null,null,null,null,null,null,null,"No","N/A","N/A","N/A","N/A","N/A","N/A","N/A","N/A","N/A","N/A","N/A","N/A","N/A","N/A","N/A","N/A","N/A","N/A","N/A","N/A","N/A","N/A"]
[null,null,null,null,null,null,null,null,null,null,null,null,null,null,null,null,null,null,null,null,null,null,null,null,null,null,null,null,null,null,null,null,null,null,null,null,null,null,null,null,null,null,null,null,null,null,null,null,null,null,null,null,null,"DK/not sure/missing/no such activity","N/A","N/A","N/A","N/A","N/A","N/A","N/A","N/A","N/A","N/A","N/A","N/A","N/A","N/A","N/A","N/A","N/A","N/A","N/A","N/A","N/A","N/A"]
[null,null,null,null,null,null,null,null,null,null,null,null,null,null,null,null,null,null,null,null,null,null,null,null,null,null,null,null,null,null,null,null,null,null,null,null,null,null,null,null,null,null,null,null,null,null,null,null,null,null,null,null,"Participation in specific activities during menstruation","Did not go to school (amongst those usually attending school)","N/A","N/A","N/A","N/A","N/A","N/A","N/A","N/A","N/A","N/A","N/A","N/A","N/A","N/A","N/A","N/A","N/A","N/A","N/A","N/A","N/A","N/A"]
[null,null,null,null,null,null,null,null,null,null,null,null,null,null,null,null,null,null,null,null,null,null,null,null,null,null,null,null,null,null,null,null,null,null,null,null,null,null,null,null,null,null,null,null,null,null,null,null,null,null,null,null,null,"Did not go to work (amongst those who usually work)","N/A","N/A","N/A","N/A","N/A","N/A","N/A","N/A","N/A","N/A","N/A","N/A","N/A","N/A","N/A","N/A","N/A","N/A","N/A","N/A","N/A","N/A"]
[null,null,null,null,null,null,null,null,null,null,null,null,null,null,null,null,null,null,null,null,null,null,null,null,null,null,null,null,null,null,null,null,null,null,null,null,null,null,null,null,null,null,null,null,null,null,null,null,null,null,null,null,null,"Did not participate in social activities","N/A","N/A","N/A","N/A","N/A","N/A","N/A","N/A","N/A","N/A","N/A","N/A","N/A","N/A","N/A","N/A","N/A","N/A","N/A","N/A","N/A","N/A"]
[null,null,null,null,null,null,null,null,null,null,null,null,null,null,null,null,null,null,null,null,null,null,null,null,null,null,null,null,null,null,null,null,null,null,null,null,null,null,null,null,null,null,null,null,null,null,null,null,null,null,null,null,null,"Did not cook food","N/A","N/A","N/A","N/A","N/A","N/A","N/A","N/A","N/A","N/A","N/A","N/A","N/A","N/A","N/A","N/A","N/A","N/A","N/A","N/A","N/A","N/A"]
[null,null,null,null,null,null,null,null,null,null,null,null,null,null,null,null,null,null,null,null,null,null,null,null,null,null,null,null,null,null,null,null,null,null,null,null,null,null,null,null,null,null,null,null,null,null,null,null,null,null,null,null,null,"Did not eat with others","N/A","N/A","N/A","N/A","N/A","N/A","N/A","N/A","N/A","N/A","N/A","N/A","N/A","N/A","N/A","N/A","N/A","N/A","N/A","N/A","N/A","N/A"]
[null,null,null,null,null,null,null,null,null,null,null,null,null,null,null,null,null,null,null,null,null,null,null,null,null,null,null,null,null,null,null,null,null,null,null,null,null,null,null,null,null,null,null,null,null,null,null,null,null,null,null,null,null,"Did not bathe in regular place","N/A","N/A","N/A","N/A","N/A","N/A","N/A","N/A","N/A","N/A","N/A","N/A","N/A","N/A","N/A","N/A","N/A","N/A","N/A","N/A","N/A","N/A"]
[null,null,null,null,null,null,null,null,null,null,null,null,null,null,null,null,null,null,null,null,null,null,null,null,null,null,null,null,null,null,null,null,null,null,null,null,null,null,null,null,null,null,null,null,null,null,null,null,null,null,null,null,null,"Did not participate in other activities","N/A","N/A","N/A","N/A","N/A","N/A","N/A","N/A","N/A","N/A","N/A","N/A","N/A","N/A","N/A","N/A","N/A","N/A","N/A","N/A","N/A","N/A"]
[null,null,null,null,null,null,null,null,null,null,null,null,null,null,null,null,null,null,null,null,null,null,null,null,null,null,null,null,null,null,null,null,null,null,null,null,null,null,null,null,null,null,null,null,null,null,null,null,null,null,null,null,null,"DK/not sure/missing/no such activity","N/A","N/A","N/A","N/A","N/A","N/A","N/A","N/A","N/A","N/A","N/A","N/A","N/A","N/A","N/A","N/A","N/A","N/A","N/A","N/A","N/A","N/A"]
[]
[]
[]
[]
[]
[]
[]
[]
[]
[]
[]
[]
[]
[]
[]
[]
[]
[]
[]
[]
[]
[]
[]
[]
[]
[]
[]
[]
[]
[]
[]
[]
[]
[]
[]
[]
[]
[]
[]
[]
[]
[]
[]
[]
[]
[]
[]
[]
[]
[]
[]
[]
[]
[]
[null,null,null,null,null,null,null,null,null,null,null,null,null,null,null,null,null,null,null,null,null,null,null,null,null,null,null,null,null,null,null,null,null,null,null,null,null,null,null,null,null,null,null,null,null,null,null,null,null,null,null,null,"Raw numbers of respondents:","Basic water, sanitation and hygiene","NATIONAL wealth index quintile",null,null,null,null,"URBAN wealth index quintile",null,null,null,null,"RURAL wealth index quintile",null,null,null,null,"SUB-REGIONS:"]
[null,null,null,null,null,null,null,null,null,null,null,null,null,null,null,null,null,null,null,null,null,null,null,null,null,null,null,null,null,null,null,null,null,null,null,null,null,null,null,null,null,null,null,null,null,null,null,null,null,null,null,null,"WatSan data, raw numbers (weighted)",null,"Poorest","Poor","Middle","Rich","Richest","Poorest","Poor","Middle","Rich","Richest","Poorest","Poor","Middle","Rich","Richest","Brest","Gomel","Grodno","Minsk","Minsk city","Mogilev","Vitebsk"]
[null,null,null,null,null,null,null,null,null,null,null,null,null,null,null,null,null,null,null,null,null,null,null,null,null,null,null,null,null,null,null,null,null,null,null,null,null,null,null,null,null,null,null,null,null,null,null,null,null,null,null,null,"Use of Basic Water Sanitation and Hygiene","Yes","N/A","N/A","N/A","N/A","N/A","N/A","N/A","N/A","N/A","N/A","N/A","N/A","N/A","N/A","N/A","N/A","N/A","N/A","N/A","N/A","N/A","N/A"]
[null,null,null,null,null,null,null,null,null,null,null,null,null,null,null,null,null,null,null,null,null,null,null,null,null,null,null,null,null,null,null,null,null,null,null,null,null,null,null,null,null,null,null,null,null,null,null,null,null,null,null,null,null,"No","N/A","N/A","N/A","N/A","N/A","N/A","N/A","N/A","N/A","N/A","N/A","N/A","N/A","N/A","N/A","N/A","N/A","N/A","N/A","N/A","N/A","N/A"]
[null,null,null,null,null,null,null,null,null,null,null,null,null,null,null,null,null,null,null,null,null,null,null,null,null,null,null,null,null,null,null,null,null,null,null,null,null,null,null,null,null,null,null,null,null,null,null,null,null,null,null,null,"Use of Basic Water and Sanitation","Yes","N/A","N/A","N/A","N/A","N/A","N/A","N/A","N/A","N/A","N/A","N/A","N/A","N/A","N/A","N/A","N/A","N/A","N/A","N/A","N/A","N/A","N/A"]
[null,null,null,null,null,null,null,null,null,null,null,null,null,null,null,null,null,null,null,null,null,null,null,null,null,null,null,null,null,null,null,null,null,null,null,null,null,null,null,null,null,null,null,null,null,null,null,null,null,null,null,null,null,"No","N/A","N/A","N/A","N/A","N/A","N/A","N/A","N/A","N/A","N/A","N/A","N/A","N/A","N/A","N/A","N/A","N/A","N/A","N/A","N/A","N/A","N/A"]
[null,null,null,null,null,null,null,null,null,null,null,null,null,null,null,null,null,null,null,null,null,null,null,null,null,null,null,null,null,null,null,null,null,null,null,null,null,null,null,null,null,null,null,null,null,null,null,null,null,null,null,null,"Use of Basic Water and Hygiene","Yes","N/A","N/A","N/A","N/A","N/A","N/A","N/A","N/A","N/A","N/A","N/A","N/A","N/A","N/A","N/A","N/A","N/A","N/A","N/A","N/A","N/A","N/A"]
[null,null,null,null,null,null,null,null,null,null,null,null,null,null,null,null,null,null,null,null,null,null,null,null,null,null,null,null,null,null,null,null,null,null,null,null,null,null,null,null,null,null,null,null,null,null,null,null,null,null,null,null,null,"No","N/A","N/A","N/A","N/A","N/A","N/A","N/A","N/A","N/A","N/A","N/A","N/A","N/A","N/A","N/A","N/A","N/A","N/A","N/A","N/A","N/A","N/A"]
[null,null,null,null,null,null,null,null,null,null,null,null,null,null,null,null,null,null,null,null,null,null,null,null,null,null,null,null,null,null,null,null,null,null,null,null,null,null,null,null,null,null,null,null,null,null,null,null,null,null,null,null,"Use of Basic Sanitation and Hygiene","Yes","N/A","N/A","N/A","N/A","N/A","N/A","N/A","N/A","N/A","N/A","N/A","N/A","N/A","N/A","N/A","N/A","N/A","N/A","N/A","N/A","N/A","N/A"]
[null,null,null,null,null,null,null,null,null,null,null,null,null,null,null,null,null,null,null,null,null,null,null,null,null,null,null,null,null,null,null,null,null,null,null,null,null,null,null,null,null,null,null,null,null,null,null,null,null,null,null,null,null,"No","N/A","N/A","N/A","N/A","N/A","N/A","N/A","N/A","N/A","N/A","N/A","N/A","N/A","N/A","N/A","N/A","N/A","N/A","N/A","N/A","N/A","N/A"]
[null,null,null,null,null,null,null,null,null,null,null,null,null,null,null,null,null,null,null,null,null,null,null,null,null,null,null,null,null,null,null,null,null,null,null,null,null,null,null,null,null,null,null,null,null,null,null,null,null,null,null,null,"Use of Basic Water","Yes","N/A","N/A","N/A","N/A","N/A","N/A","N/A","N/A","N/A","N/A","N/A","N/A","N/A","N/A","N/A","N/A","N/A","N/A","N/A","N/A","N/A","N/A"]
[null,null,null,null,null,null,null,null,null,null,null,null,null,null,null,null,null,null,null,null,null,null,null,null,null,null,null,null,null,null,null,null,null,null,null,null,null,null,null,null,null,null,null,null,null,null,null,null,null,null,null,null,null,"No","N/A","N/A","N/A","N/A","N/A","N/A","N/A","N/A","N/A","N/A","N/A","N/A","N/A","N/A","N/A","N/A","N/A","N/A","N/A","N/A","N/A","N/A"]
[null,null,null,null,null,null,null,null,null,null,null,null,null,null,null,null,null,null,null,null,null,null,null,null,null,null,null,null,null,null,null,null,null,null,null,null,null,null,null,null,null,null,null,null,null,null,null,null,null,null,null,null,"Use of Basic Sanitation","Yes","N/A","N/A","N/A","N/A","N/A","N/A","N/A","N/A","N/A","N/A","N/A","N/A","N/A","N/A","N/A","N/A","N/A","N/A","N/A","N/A","N/A","N/A"]
[null,null,null,null,null,null,null,null,null,null,null,null,null,null,null,null,null,null,null,null,null,null,null,null,null,null,null,null,null,null,null,null,null,null,null,null,null,null,null,null,null,null,null,null,null,null,null,null,null,null,null,null,null,"No","N/A","N/A","N/A","N/A","N/A","N/A","N/A","N/A","N/A","N/A","N/A","N/A","N/A","N/A","N/A","N/A","N/A","N/A","N/A","N/A","N/A","N/A"]
[null,null,null,null,null,null,null,null,null,null,null,null,null,null,null,null,null,null,null,null,null,null,null,null,null,null,null,null,null,null,null,null,null,null,null,null,null,null,null,null,null,null,null,null,null,null,null,null,null,null,null,null,"Access to Basic Hygiene","Yes","N/A","N/A","N/A","N/A","N/A","N/A","N/A","N/A","N/A","N/A","N/A","N/A","N/A","N/A","N/A","N/A","N/A","N/A","N/A","N/A","N/A","N/A"]
[null,null,null,null,null,null,null,null,null,null,null,null,null,null,null,null,null,null,null,null,null,null,null,null,null,null,null,null,null,null,null,null,null,null,null,null,null,null,null,null,null,null,null,null,null,null,null,null,null,null,null,null,null,"No","N/A","N/A","N/A","N/A","N/A","N/A","N/A","N/A","N/A","N/A","N/A","N/A","N/A","N/A","N/A","N/A","N/A","N/A","N/A","N/A","N/A","N/A"]
[]
[]
[]
[]
[]
[]
[]
[]
[]
[]
[]
[]
[]
[]
[]
[]
[]
[]
[]
[]
[]
[]
[]
[]
[]
[]
[]
[]
[]
[]
[]
[]
[]
[]
[]
[]
[]
[]
[]
[]
[]
[]
[]
[]
[null,null,"INITIAL (national) Wealth Index",null,null,null,null,"URBAN Wealth Index",null,null,null,null,"RURAL Wealth Index"]
[null,null,"Component Matrix",null,null,null,null,"Component Matrix",null,null,null,null,"Component Matrix"]
[null,null,null,null,"Component",null,null,null,null,"Component",null,null,null,null,"Component"]
[null,"Note:\n\nThe INITIAL (national) Wealth Index is based on the first component of the Principal Component Analysis (PCA) which has been obtained at national level.\n\nThe final national-level (NATIONAL) Wealth Index is based on the URBAN and RURAL specific wealth indexes. Regression procedures are used to establish the relationships between the two sets of scores (urban and rural) and the initial (national) wealth factors.\nThis allows best use of the available information for each area and a better precision of the FINAL (NATIONAL) Wealth Index.\n\nFor dependency reasons, all WASH variables (contained in the generic MICS and DHS scripts) have been excluded from the sets of asset variables used in the PCAs.\n\nThe PCA can extracts as many components as there are asset variables in the input. Only the first of the components is used to represent the Wealth Index. \n\nThe scores represent the weights of the asset variables on the Wealth Index (correlations between the variables and the component).\n\nThe communalities are the proportion of each variable's variance that can be explained by the component.\n\nProportion of explained variance is the part of the model's total variance that is explained by the component.\n\nFor more information on the procedure used:\n\nThe DHS Wealth Index, DHS Comparative Reports No. 6, Shea Oscar Rutstein, Kiersten Johnson, ORC Macro International Inc., 2004.\n\nThe DHS Wealth Index: Approaches for Rural and Urban Areas, Shea O. Rutstein, ORC Macro International Inc., 2008.\n\nMICS Methodological Paper No. 4, Review of options for reporting water, sanitation and hygiene coverage by wealth quintile, UNICEF, 2016.",null,null,"1",null,null,null,null,"1",null,null,null,null,"1"]
[null,null,"Has ruberoid roof",null,0.81190978309052475,null,null,"Has ruberoid roof",null,0.82602464104209827,null,null,"Has wood wall",null,-0.66693063539277597]
[null,null,"Has slate roof",null,-0.80837492392215671,null,null,"Has slate roof",null,-0.81760670807374536,null,null,"Has ruberoid roof",null,0.66469101578353418]
[null,null,"Has wood wall",null,-0.68659737692574696,null,null,"Has wood wall",null,-0.64807605385138145,null,null,"Has slate roof",null,-0.65734323700489949]
[null,null,"Household fuel type: LPG",null,-0.67810284717192792,null,null,"Has plastic wall",null,0.63758094678616695,null,null,"Household fuel type: natural gas",null,0.63967856523422084]
[null,null,"Has wood floor",null,-0.65293596353778149,null,null,"Household fuel type: LPG",null,-0.62696029994551783,null,null,"Has wood floor",null,-0.56479939465963946]
[null,null,"Household fuel type: natural gas",null,0.59819434651906089,null,null,"Has wood floor",null,-0.59335967443302717,null,null,"Household has: fan",null,0.52531518402922006]
[null,null,"Has plastic wall",null,0.59391784577304496,null,null,"Has linoleum floor",null,0.3966820813245221,null,null,"Has plastic wall",null,0.50978592118960786]
[null,null,"Household has: fan",null,0.5297832797958566,null,null,"Household has: fan",null,0.3299894941733908,null,null,"Household has: mobile telephone",null,0.45505579749019986]
[null,null,"Household has: mobile telephone",null,0.46698482654998869,null,null,"Household fuel type: natural gas",null,0.3067648166170942,null,null,"Household fuel type: LPG",null,-0.4357462784866668]
[null,null,"Household has: non-mobile phone",null,0.45799721192463427,null,null,"Household has: mobile telephone",null,0.29966535064278249,null,null,"Has other floor",null,0.42488693058802823]
[null,null,"Has linoleum floor",null,0.4083553385889247,null,null,"Household has: non-mobile phone",null,0.25591359829590932,null,null,"Household has: non-mobile phone",null,0.40631352501261669]
[null,null,"Household fuel type: wood",null,-0.36577848459836931,null,null,"Has brick wall",null,-0.24992421360273989,null,null,"Household fuel type: wood",null,-0.3753126414517523]
[null,null,"Household has: AC",null,0.32750470028995665,null,null,"Household has: AC",null,0.24633498135738571,null,null,"Household member owns: car/truck",null,0.36514571017563685]
[null,null,"Household member owns: animal drawn cart",null,-0.30229724076529157,null,null,"Household fuel type: wood",null,-0.23917795361180205,null,null,"Household has: AC",null,0.30942052782477031]
[null,null,"Household member owns: bicycle",null,-0.29183663564125678,null,null,"Household cooks on closed owen",null,-0.20320409661986769,null,null,"Has brick wall",null,0.28116310414019141]
[null,null,"Household cooks on open owen",null,-0.27643422280582208,null,null,"Household member owns: bicycle",null,-0.19640078199572747,null,null,"Household cooks on open owen",null,-0.27391373776884509]
[null,null,"Has other floor",null,0.26108507657341945,null,null,"Household has: radio",null,0.19059294330446225,null,null,"Household has: refrigerator",null,0.25804401350751799]
[null,null,"Household has: refrigerator",null,0.25654761713041857,null,null,"Has other floor",null,0.17131457954682619,null,null,"Household cooks on closed owen",null,-0.24638578738435271]
[null,null,"Household member owns: car/truck",null,0.24539039216368685,null,null,"Household has: refrigerator",null,0.16306841126690261,null,null,"Has linoleum floor",null,0.2450128765433518]
[null,null,"Household cooks on closed owen",null,-0.23543081081318556,null,null,"Household fuel type: electricity",null,0.16086762337823454,null,null,"Household member owns: animal drawn cart",null,-0.22492706067278984]
[null,null,"Has parquet/polished wood floor",null,0.21386793131302068,null,null,"Household member owns: car/truck",null,0.15465368822634126,null,null,"Has parquet/polished wood floor",null,0.2152594282799207]
[null,null,"Household fuel type: electricity",null,0.21317842388273878,null,null,"Has parquet/polished wood floor",null,0.14501374829723535,null,null,"Household has: radio",null,-0.20258106247879984]
[null,null,"Household cooks in owm house",null,0.15964256509756405,null,null,"Persons per sleeping rooms",null,0.13695368436489919,null,null,"Household has: television",null,0.15905537163524408]
[null,null,"Household cooks in other house",null,-0.15964256509756225,null,null,"Household cooks on open owen",null,-0.12587627137098464,null,null,"Household fuel type: electricity",null,0.13571086046780201]
[null,null,"Household has: radio",null,0.15405761527679077,null,null,"Has metal roof",null,-0.11805074784281325,null,null,"Household cooks in other house",null,-0.11491069440724618]
[null,null,"Household has: television",null,0.14017470166048646,null,null,"Household has: television",null,0.10616248383479818,null,null,"Household cooks in owm house",null,0.11491069440724526]
[null,null,"Household member owns: motorcycle/scooter",null,-0.13372312758641991,null,null,"Has laminat floor",null,9.3237177128217899E-2,null,null,"Has laminat floor",null,9.8404723627243923E-2]
[null,null,"Persons per sleeping rooms",null,0.1300170722395762,null,null,"Household member owns: animal drawn cart",null,-8.9818123859694121E-2,null,null,"Household member owns: motorcycle/scooter",null,9.0913597479465202E-2]
[null,null,"Has laminat floor",null,0.12113074073042371,null,null,"Household member owns: motorcycle/scooter",null,-7.5277366904324849E-2,null,null,"Persons per sleeping rooms",null,8.4086898156648424E-2]
[null,null,"Household has: computer",null,0.11454823844097653,null,null,"Household cooks in other house",null,3.6726594517454726E-2,null,null,"Household has: computer",null,6.6447107841587305E-2]
[null,null,"Has carpet floor",null,6.652916716525073E-2,null,null,"Household cooks in owm house",null,-3.6726594517454025E-2,null,null,"Household member owns: boat with motor",null,6.1651685425499619E-2]
[null,null,"Has metal roof",null,-4.6290843886462651E-2,null,null,"Household has: computer",null,3.1414300931379861E-2,null,null,"Household member owns: bicycle",null,5.7325026656569307E-2]
[null,null,"Household member owns: watch",null,3.1218320572793962E-2,null,null,"Has cement tile roof",null,-2.6673903511484732E-2,null,null,"Has concrete or ferro-concrete wall",null,3.794768418581404E-2]
[null,null,"Has wood roof",null,-2.4328657993774701E-2,null,null,"Has carpet floor",null,2.5352513385118607E-2,null,null,"Has metal roof",null,3.2101943246835275E-2]
[null,null,"Has concrete or ferro-concrete wall",null,-1.9907360751323135E-2,null,null,"Has cement block wall",null,-2.0601498305183697E-2,null,null,"Has wood roof",null,-1.9434853908200805E-2]
[null,null,"Has cement tile roof",null,-1.9181491154504668E-2,null,null,"Has concrete or ferro-concrete wall",null,2.0236478598500311E-2,null,null,"Has carpet floor",null,1.8755899562902766E-2]
[null,null,"Has ceramic tile floor",null,1.8532227782345596E-2,null,null,"Has ceramic tile floor",null,1.9724010572907891E-2,null,null,"Household member owns: watch",null,1.0900701828510315E-2]
[null,null,"Household member owns: boat with motor",null,1.5781750812055309E-2,null,null,"Has wood roof",null,-1.3994079259797875E-2,null,null,"Has cement tile roof",null,9.2036441692803297E-3]
[null,null,"Has cement floor",null,1.0243641146544146E-2,null,null,"Household member owns: boat with motor",null,1.2316890126815689E-2,null,null,"Has wood roof",null,7.7970594637357038E-3]
[null,null,"Has wood roof",null,-7.4041471920257155E-3,null,null,"Household member owns: watch",null,9.7132188980518959E-3,null,null,"Has cement block wall",null,5.8973827820447168E-3]
[null,null,"Has brick wall",null,-5.2946774619379673E-3,null,null,"Has cement floor",null,4.9267753362101365E-3]
[null,null,"Has cement block wall",null,-4.8298820009484043E-3]
[]
[null,null,null,null,null,null,null,null,null,null,null,null,"Communalities"]
[null,null,null,null,null,null,null,"Communalities",null,null,null,null,null,null,"Extraction"]
[null,null,"Communalities",null,null,null,null,null,null,"Extraction",null,null,"Persons per sleeping rooms",null,7.0706064416065639E-3]
[null,null,null,null,"Extraction",null,null,"Persons per sleeping rooms",null,1.875631166112043E-2,null,null,"Has wood floor",null,0.31899835620789518]
[null,null,"Persons per sleeping rooms",null,1.6904439073751176E-2,null,null,"Has wood floor",null,0.35207570324326798,null,null,"Has parquet/polished wood floor",null,4.6336621463398321E-2]
[null,null,"Has wood floor",null,0.4263253724810111,null,null,"Has parquet/polished wood floor",null,2.1028987195213927E-2,null,null,"Has linoleum floor",null,6.0031309672047749E-2]
[null,null,"Has parquet/polished wood floor",null,4.573949204411093E-2,null,null,"Has ceramic tile floor",null,3.8903659308018229E-4,null,null,"Has carpet floor",null,3.5178376841369616E-4]
[null,null,"Has ceramic tile floor",null,3.43443466576742E-4,null,null,"Has linoleum floor",null,0.15735667364395475,null,null,"Has laminat floor",null,9.6834896321542577E-3]
[null,null,"Has linoleum floor",null,0.16675408255407534,null,null,"Has cement floor",null,2.4273115213488506E-5,null,null,"Has other floor",null,0.18052890378451592]
[null,null,"Has cement floor",null,1.0493218393917227E-4,null,null,"Has carpet floor",null,6.4274993494261819E-4,null,null,"Has wood roof",null,6.0794136281030502E-5]
[null,null,"Has carpet floor",null,4.4261300837018756E-3,null,null,"Has laminat floor",null,8.6931711988386794E-3,null,null,"Has metal roof",null,1.030534760223033E-3]
[null,null,"Has laminat floor",null,1.467265634990113E-2,null,null,"Has other floor",null,2.9348685165305838E-2,null,null,"Has wood roof",null,3.7771354643310808E-4]
[null,null,"Has other floor",null,6.8165417209348295E-2,null,null,"Has wood roof",null,1.9583425432950506E-4,null,null,"Has cement tile roof",null,8.4707065994727817E-5]
[null,null,"Has wood roof",null,5.4821395641182287E-5,null,null,"Has metal roof",null,1.3935979066247477E-2,null,null,"Has slate roof",null,0.43210013123607949]
[null,null,"Has metal roof",null,2.1428422277208568E-3,null,null,"Has cement tile roof",null,7.114971285399975E-4,null,null,"Has ruberoid roof",null,0.44181414646334649]
[null,null,"Has wood roof",null,5.918835997780577E-4,null,null,"Has slate roof",null,0.6684807290871867,null,null,"Has brick wall",null,7.9052691129748123E-2]
[null,null,"Has cement tile roof",null,3.6792960291034081E-4,null,null,"Has ruberoid roof",null,0.68231670760872731,null,null,"Has cement block wall",null,3.4779123677957483E-5]
[null,null,"Has slate roof",null,0.65347001762615264,null,null,"Has brick wall",null,6.2462112544947955E-2,null,null,"Has wood wall",null,0.44479647242541187]
[null,null,"Has ruberoid roof",null,0.65919749587810295,null,null,"Has cement block wall",null,4.2442173241848672E-4,null,null,"Has plastic wall",null,0.25988168544313706]
[null,null,"Has brick wall",null,2.8033609425953875E-5,null,null,"Has wood wall",null,0.42000257157557869,null,null,"Has concrete or ferro-concrete wall",null,1.4400267350662809E-3]
[null,null,"Has cement block wall",null,2.332776014308536E-5,null,null,"Has plastic wall",null,0.40650946370474506,null,null,"Household fuel type: electricity",null,1.8417437648911225E-2]
[null,null,"Has wood wall",null,0.47141595800131625,null,null,"Has concrete or ferro-concrete wall",null,4.0951506606756109E-4,null,null,"Household fuel type: LPG",null,0.18987481921497978]
[null,null,"Has plastic wall",null,0.35273840752769442,null,null,"Household fuel type: electricity",null,2.5878392251361512E-2,null,null,"Household fuel type: natural gas",null,0.40918866682011135]
[null,null,"Has concrete or ferro-concrete wall",null,3.9630301208332081E-4,null,null,"Household fuel type: LPG",null,0.39307921770777371,null,null,"Household fuel type: wood",null,0.14085957883349159]
[null,null,"Household fuel type: electricity",null,4.5445040409128654E-2,null,null,"Household fuel type: natural gas",null,9.4104652714119441E-2,null,null,"Household cooks on open owen",null,7.5028735738499636E-2]
[null,null,"Household fuel type: LPG",null,0.45982347134267504,null,null,"Household fuel type: wood",null,5.7206093493929334E-2,null,null,"Household cooks on closed owen",null,6.0705956225007462E-2]
[null,null,"Household fuel type: natural gas",null,0.35783647620736631,null,null,"Household cooks on open owen",null,1.5844835694261768E-2,null,null,"Household cooks in owm house",null,1.3204467689155307E-2]
[null,null,"Household fuel type: wood",null,0.1337938997950795,null,null,"Household cooks on closed owen",null,4.1291904883096524E-2,null,null,"Household cooks in other house",null,1.3204467689155517E-2]
[null,null,"Household cooks on open owen",null,7.6415879538258888E-2,null,null,"Household cooks in owm house",null,1.348842744849484E-3,null,null,"Household has: radio",null,4.1039086875039404E-2]
[null,null,"Household cooks on closed owen",null,5.5427666680153975E-2,null,null,"Household cooks in other house",null,1.3488427448495356E-3,null,null,"Household has: television",null,2.5298611246025608E-2]
[null,null,"Household cooks in owm house",null,2.5485748590929978E-2,null,null,"Household has: radio",null,3.6325670037457958E-2,null,null,"Household has: mobile telephone",null,0.20707577882944178]
[null,null,"Household cooks in other house",null,2.5485748590929402E-2,null,null,"Household has: television",null,1.1270472973973784E-2,null,null,"Household has: non-mobile phone",null,0.1650906806081783]
[null,null,"Household has: radio",null,2.3733748824771677E-2,null,null,"Household has: mobile telephone",null,8.9799322375861787E-2,null,null,"Household has: refrigerator",null,6.6586712907068121E-2]
[null,null,"Household has: television",null,1.9648946985606385E-2,null,null,"Household has: non-mobile phone",null,6.5491769792760043E-2,null,null,"Household has: fan",null,0.27595604257165335]
[null,null,"Household has: mobile telephone",null,0.21807482822792301,null,null,"Household has: refrigerator",null,2.659130675311169E-2,null,null,"Household has: computer",null,4.4152181405115332E-3]
[null,null,"Household has: non-mobile phone",null,0.20976144613073835,null,null,"Household has: fan",null,0.10889306626481032,null,null,"Household has: AC",null,9.5741063039359461E-2]
[null,null,"Household has: refrigerator",null,6.5816679855295837E-2,null,null,"Household has: computer",null,9.868583030072937E-4,null,null,"Household member owns: watch",null,1.1882530035408812E-4]
[null,null,"Household has: fan",null,0.28067032355125487,null,null,"Household has: AC",null,6.0680923040343566E-2,null,null,"Household member owns: bicycle",null,3.2861586811763818E-3]
[null,null,"Household has: computer",null,1.3121298929930813E-2,null,null,"Household member owns: watch",null,9.4346621361472482E-5,null,null,"Household member owns: motorcycle/scooter",null,8.2652822066582223E-3]
[null,null,"Household has: AC",null,0.10725932871201434,null,null,"Household member owns: bicycle",null,3.8573267168533265E-2,null,null,"Household member owns: animal drawn cart",null,5.0592182622900883E-2]
[null,null,"Household member owns: watch",null,9.7458353938573074E-4,null,null,"Household member owns: motorcycle/scooter",null,5.6666819680483418E-3,null,null,"Household member owns: car/truck",null,0.13333138965967017]
[null,null,"Household member owns: bicycle",null,8.5168621902407662E-2,null,null,"Household member owns: animal drawn cart",null,8.0672953736753549E-3,null,null,"Household member owns: boat with motor",null,3.8009303158047622E-3]
[null,null,"Household member owns: motorcycle/scooter",null,1.7881874851493937E-2,null,null,"Household member owns: car/truck",null,2.3917763282010365E-2]
[null,null,"Household member owns: animal drawn cart",null,9.1383621774308657E-2,null,null,"Household member owns: boat with motor",null,1.517057823960498E-4]
[null,null,"Household member owns: car/truck",null,6.0216444566248029E-2,null,null,null,null,null,null,null,"Total Variance Explained"]
[null,null,"Household member owns: boat with motor",null,2.4906365869380842E-4,null,null,null,null,null,null,null,"Component",null,"Extraction Sums of Squared Loadings"]
[null,null,null,null,null,null,null,"Total Variance Explained",null,null,null,null,null,null,"Total","% of Variance","Cumulative %"]
[null,null,null,null,null,null,null,"Component",null,"Extraction Sums of Squared Loadings",null,null,"1",null,4.2847568458985847,10.711892114746462,10.711892114746462]
[null,null,"Total Variance Explained",null,null,null,null,null,null,"Total","% of Variance","Cumulative %"]
[null,null,"Component",null,"Extraction Sums of Squared Loadings",null,null,"1",null,3.950377655491319,9.6350674524178519,9.6350674524178519]
[null,null,null,null,"Total","% of Variance","Cumulative %",null,null,null,null,null,"Component Score Coefficient Matrix"]
[null,null,"1",null,5.2575377283519806,12.517946972266619,12.517946972266619,null,null,null,null,null,null,null,"Component"]
[null,null,null,null,null,null,null,"Component Score Coefficient Matrix",null,null,null,null,null,null,"1"]
[null,null,null,null,null,null,null,null,null,"Component",null,null,"Persons per sleeping rooms",null,1.9624660437181474E-2]
[null,null,"Component Score Coefficient Matrix",null,null,null,null,null,null,"1",null,null,"Has wood floor",null,-0.13181597345489315]
[null,null,null,null,"Component",null,null,"Persons per sleeping rooms",null,3.466850420605315E-2,null,null,"Has parquet/polished wood floor",null,5.02384233275616E-2]
[null,null,null,null,"1",null,null,"Has wood floor",null,-0.15020327831396399,null,null,"Has linoleum floor",null,5.7182445901890741E-2]
[null,null,"Persons per sleeping rooms",null,2.4729650828455619E-2,null,null,"Has parquet/polished wood floor",null,3.6708831646932651E-2,null,null,"Has carpet floor",null,4.3773544771522135E-3]
[null,null,"Has wood floor",null,-0.12419044755812907,null,null,"Has ceramic tile floor",null,4.9929430279887412E-3,null,null,"Has laminat floor",null,2.296623289637497E-2]
[null,null,"Has parquet/polished wood floor",null,4.0678344571777221E-2,null,null,"Has linoleum floor",null,0.10041624267824228,null,null,"Has other floor",null,9.9162436952457314E-2]
[null,null,"Has ceramic tile floor",null,3.5248872646996077E-3,null,null,"Has cement floor",null,1.2471656550004913E-3,null,null,"Has wood roof",null,1.8197204051845167E-3]
[null,null,"Has linoleum floor",null,7.7670453297332256E-2,null,null,"Has carpet floor",null,6.4177442250051018E-3,null,null,"Has metal roof",null,7.4921271851315441E-3]
[null,null,"Has cement floor",null,1.948372351434386E-3,null,null,"Has laminat floor",null,2.3602092067985265E-2,null,null,"Has wood roof",null,-4.5358125576726851E-3]
[null,null,"Has carpet floor",null,1.2654054160464365E-2,null,null,"Has other floor",null,4.3366633392300138E-2,null,null,"Has cement tile roof",null,2.147996840961969E-3]
[null,null,"Has laminat floor",null,2.3039442984347958E-2,null,null,"Has wood roof",null,-3.5424661843014081E-3,null,null,"Has slate roof",null,-0.15341436180541157]
[null,null,"Has other floor",null,4.9659192204267608E-2,null,null,"Has metal roof",null,-2.9883408154335298E-2,null,null,"Has ruberoid roof",null,0.15512922662572642]
[null,null,"Has wood roof",null,-1.4082917849733833E-3,null,null,"Has cement tile roof",null,-6.7522413899860989E-3,null,null,"Has brick wall",null,6.5619383841891463E-2]
[null,null,"Has metal roof",null,-8.8046622351054277E-3,null,null,"Has slate roof",null,-0.20696925189853965,null,null,"Has cement block wall",null,1.3763634656864497E-3]
[null,null,"Has wood roof",null,-4.6273862881818497E-3,null,null,"Has ruberoid roof",null,0.20910017043405013,null,null,"Has wood wall",null,-0.15565192130591243]
[null,null,"Has cement tile roof",null,-3.6483791739745199E-3,null,null,"Has brick wall",null,-6.326590402194246E-2,null,null,"Has plastic wall",null,0.11897662796841797]
[null,null,"Has slate roof",null,-0.15375542044384888,null,null,"Has cement block wall",null,-5.2150705835797952E-3,null,null,"Has concrete or ferro-concrete wall",null,8.8564381948856626E-3]
[null,null,"Has ruberoid roof",null,0.15442776163301541,null,null,"Has wood wall",null,-0.16405420199522125,null,null,"Household fuel type: electricity",null,3.1672943261110816E-2]
[null,null,"Has brick wall",null,-1.0070640926427797E-3,null,null,"Has plastic wall",null,0.16139746687253609,null,null,"Household fuel type: LPG",null,-0.10169685099021847]
[null,null,"Has cement block wall",null,-9.1865855282456958E-4,null,null,"Has concrete or ferro-concrete wall",null,5.1226693656415603E-3,null,null,"Household fuel type: natural gas",null,0.149291684041891]
[null,null,"Has wood wall",null,-0.13059295289944917,null,null,"Household fuel type: electricity",null,4.072208720465411E-2,null,null,"Household fuel type: wood",null,-8.7592518070425784E-2]
[null,null,"Has plastic wall",null,0.11296501831461202,null,null,"Household fuel type: LPG",null,-0.15870895256659734,null,null,"Household cooks on open owen",null,-6.3927487047727868E-2]
[null,null,"Has concrete or ferro-concrete wall",null,-3.7864418250334211E-3,null,null,"Household fuel type: natural gas",null,7.7654554417263946E-2,null,null,"Household cooks on closed owen",null,-5.7502863346888831E-2]
[null,null,"Household fuel type: electricity",null,4.0547198117694042E-2,null,null,"Household fuel type: wood",null,-6.0545591958613594E-2,null,null,"Household cooks in owm house",null,2.6818486681978004E-2]
[null,null,"Household fuel type: LPG",null,-0.12897726696570661,null,null,"Household cooks on open owen",null,-3.1864363954167078E-2,null,null,"Household cooks in other house",null,-2.6818486681978216E-2]
[null,null,"Household fuel type: natural gas",null,0.11377842203456143,null,null,"Household cooks on closed owen",null,-5.143915704803536E-2,null,null,"Household has: radio",null,-4.7279476937579931E-2]
[null,null,"Household fuel type: wood",null,-6.9572203471952213E-2,null,null,"Household cooks in owm house",null,-9.2969831546108814E-3,null,null,"Household has: television",null,3.7121213024606893E-2]
[null,null,"Household cooks on open owen",null,-5.2578647475055362E-2,null,null,"Household cooks in other house",null,9.29698315461106E-3,null,null,"Household has: mobile telephone",null,0.10620341220197459]
[null,null,"Household cooks on closed owen",null,-4.477967120304116E-2,null,null,"Household has: radio",null,4.8246765227502708E-2,null,null,"Household has: non-mobile phone",null,9.4827673920760386E-2]
[null,null,"Household cooks in owm house",null,3.0364511553891482E-2,null,null,"Household has: television",null,2.6874008789317755E-2,null,null,"Household has: refrigerator",null,6.0223723956359512E-2]
[null,null,"Household cooks in other house",null,-3.0364511553891142E-2,null,null,"Household has: mobile telephone",null,7.5857393083981567E-2,null,null,"Household has: fan",null,0.12260093231009303]
[null,null,"Household has: radio",null,2.9302236757334971E-2,null,null,"Household has: non-mobile phone",null,6.4782058986226382E-2,null,null,"Household has: computer",null,1.5507789643930715E-2]
[null,null,"Household has: television",null,2.6661663482617639E-2,null,null,"Household has: refrigerator",null,4.1279195430904018E-2,null,null,"Household has: AC",null,7.2214256013372377E-2]
[null,null,"Household has: mobile telephone",null,8.8821963945538651E-2,null,null,"Household has: fan",null,8.3533657526307856E-2,null,null,"Household member owns: watch",null,2.5440654442140829E-3]
[null,null,"Household has: non-mobile phone",null,8.7112491738256623E-2,null,null,"Household has: computer",null,7.9522272731852965E-3,null,null,"Household member owns: bicycle",null,1.3378828418569759E-2]
[null,null,"Household has: refrigerator",null,4.8796153329904043E-2,null,null,"Household has: AC",null,6.2357324499079658E-2,null,null,"Household member owns: motorcycle/scooter",null,2.1217912882615191E-2]
[null,null,"Household has: fan",null,0.10076642473508636,null,null,"Household member owns: watch",null,2.4588076748940186E-3,null,null,"Household member owns: animal drawn cart",null,-5.2494708279208997E-2]
[null,null,"Household has: computer",null,2.1787430610960667E-2,null,null,"Household member owns: bicycle",null,-4.9716963572512048E-2,null,null,"Household member owns: car/truck",null,8.5219704013112962E-2]
[null,null,"Household has: AC",null,6.2292410860666489E-2,null,null,"Household member owns: motorcycle/scooter",null,-1.9055739341701596E-2,null,null,"Household member owns: boat with motor",null,1.4388607718665129E-2]
[null,null,"Household member owns: watch",null,5.9378215023441431E-3,null,null,"Household member owns: animal drawn cart",null,-2.2736591711640591E-2]
[null,null,"Household member owns: bicycle",null,-5.5508234219126658E-2,null,null,"Household member owns: car/truck",null,3.9149089457652511E-2]
[null,null,"Household member owns: motorcycle/scooter",null,-2.5434554062313233E-2,null,null,"Household member owns: boat with motor",null,3.1179019326656766E-3,null,null,"Component Score Covariance Matrix"]
[null,null,"Household member owns: animal drawn cart",null,-5.7497873792728686E-2,null,null,null,null,null,null,null,"Component",null,"1"]
[null,null,"Household member owns: car/truck",null,4.6674014499294252E-2,null,null,null,null,null,null,null,"1",null,1.0000000000000002]
[null,null,"Household member owns: boat with motor",null,3.0017380050265919E-3,null,null,"Component Score Covariance Matrix"]
[null,null,null,null,null,null,null,"Component",null,"1"]
[null,null,null,null,null,null,null,"1",null,0.99999999999999989]
[null,null,"Component Score Covariance Matrix"]
[null,null,"Component",null,"1"]
[null,null,"1",null,1]
[]
[]
[]
[]
[]
[]
[]
[]
[]
[]
[]
[]
[]
[]
[]
[]
[]
[]
[]
[]
[]
[]
[]
[]
[]
[]
[]
[]
[]
[]
[]
[]
[]
[]
[]
[]
[]
[]
[]
[]
[]
[]
[]
[]
[]
[]
[]
[]
[]
[]
[]
[]
[]
[]
[]
[]
[]
[]
[]
[]
[]
[]
[]
[]
[]
[]
[]
[]
[]
[]
[]
[]
[]
[]
[]
[]
[]
[]
[]
[]
[]
[]
[]
[]
[]
[]
[]
[]
[]
[]
[]
[]
[]
[]
[]
[]
[]
[]
[]
[]
[]
[]
[]
[]
[]
[]
[]
[]
[]
[]
[]
[]
[]
[]
[]
[]
[]
[]
[]
[]
[]
[]
[]
[]
[]
[]
[]
[]
[]
[]
[]
[]
[]
[]
[]
[]
[]
[]
[]
[]
[]
[]
[]
[]
[]
[]
[]
[]
[]
[]
[]
[]
[]
[]
[]
[]
[]
[]
[]
[]
[]
[]
[]
[]
[]
[]
[]
[]
[]
[]
[]
[]
[]
[]
[]
[]
[]
[]
[]
[]
[]
[]
[]
[]
[]
[]
[]
[]
[]
[]
[]
[]
[]
[]
[]
[]
[]
[]
[]
[]
[]
[]
[]
[]
[]
[]
[]
[]
[]
[]
[]
[]
[]
[]
[]
[]
[]
[]
[]
[]
[]
[]
[]
[]
[]
[]
[]
[]
[]
[]
[]
[]
[]
[]
[]
[]
[]
[]
[]
[]
[]
[]
[]
[]
[]
[]
[]
[]
[]
[]
[]
[]
[]
[]
[]
[]
[]
[]
[]
[]
[]
[]
[]
[]
[]
[]
[]
[]
[]
[]
[]
[]
[]
[]
[]
[]
[]
[]
[]
[]
[]
[]
[]
[]
[]
[]
[]
[]
[]
[]
[]
[]
[]
[]
[]
[]
[]
[]
[]
[]
[]
[]
[]
[]
[]
[]
[]
[]
[]
[]
[]
[]
[]
[]
[]
[]
[]
[]
[]
[]
[]
[]
[]
[]
[]
[]
[]
[]
[]
[]
[]
[]
[]
[]
[]
[]
[]
[]
[]
[]
[]
[]
[]
[]
[]
[]
[]
[]
[]
[]
[]
[]
[]
[]
[]
[]
[]
[]
[]
[]
[]
[]
[]
[]
[]
[]
[]
[]
[]
[]
[]
[]
[]
[]
[]
[]
[]
[]
[]
[]
[]
[]
[]
[]
[]
[]
[]
[]
[]
[]
[]
[]
[]
[]
[]
[]
[]
[]
[]
[]
[]
[]
[]
[]
[]
[]
[]
[]
[]
[]
[]
[]
[]
[]
[]
[]
[]
[]
[]
[]
[]
[]
[]
[]
[]
[]
[]
[]
[]
[]
[]
[]
[]
[]
[]
[]
[]
[]
[]
[]
[]
[]
[]
[]
[]
[]
[]
[]
[]
[]
[]
[]
[]
[]
[]
[]
[]
[]
[]
[]
[]
[]
[]
[]
[]
[]
[]
[]
[]
[]
[]
[]
[]
[]
[]
["MICS05"]
["Belarus",null,"Count"]
["W_text_t","",6707]
["W_text_i","",6707]
["S_text_s","",6707]
["S_text_i","",6707]
["Urban/Rural","Urban",4386]
[null,"Rural",2321]
[null,"Missing",0]
["2005"]
[]
["Sub-national region names","Weighted population"]
[{"$f":"R15","v":"Brest"},{"$f":"BR122+BR123","v":2650.8027837572863}]
[{"$f":"S15","v":"Gomel"},{"$f":"BS122+BS123","v":2705.0958557194735}]
[{"$f":"T15","v":"Grodno"},{"$f":"BT122+BT123","v":2232.4757863266145}]
[{"$f":"U15","v":"Minsk"},{"$f":"BU122+BU123","v":2837.5833624044203}]
[{"$f":"V15","v":"Minsk city"},{"$f":"BV122+BV123","v":2849.0304062087312}]
[{"$f":"W15","v":"Mogilev"},{"$f":"BW122+BW123","v":2169.7804777586125}]
[{"$f":"X15","v":"Vitebsk"},{"$f":"BX122+XR123","v":2385.1869932290065}]
[{"$f":"Y15","v":0},{"$f":"BY122+BY123","v":0}]
[{"$f":"Z15","v":0},{"$f":"BZ122+BZ123","v":0}]
[{"$f":"AA15","v":0},{"$f":"CA122+CA123","v":0}]
[{"$f":"AB15","v":0},{"$f":"CB122+CB123","v":0}]
[{"$f":"AC15","v":0},{"$f":"CC122+CC123","v":0}]
[{"$f":"AD15","v":0},{"$f":"CD122+CD123","v":0}]
[{"$f":"AE15","v":0},{"$f":"CE122+CE123","v":0}]
[{"$f":"AF15","v":0},{"$f":"CF122+CF123","v":0}]
[{"$f":"AG15","v":0},{"$f":"CG122+CG123","v":0}]
[{"$f":"AH15","v":0},{"$f":"CH122+CH123","v":0}]
[{"$f":"AI15","v":0},{"$f":"CI122+CI123","v":0}]
[{"$f":"AJ15","v":0},{"$f":"CJ122+CJ123","v":0}]
[{"$f":"AK15","v":0},{"$f":"CK122+CK123","v":0}]
[{"$f":"AL15","v":0},{"$f":"CL122+CL123","v":0}]
[{"$f":"AM15","v":0},{"$f":"CM122+CM123","v":0}]
[{"$f":"AN15","v":0},{"$f":"CN122+CN123","v":0}]
[{"$f":"AO15","v":0},{"$f":"CO122+CO123","v":0}]
[{"$f":"AP15","v":0},{"$f":"CP122+CP123","v":0}]
[{"$f":"AQ15","v":0},{"$f":"CQ122+CQ123","v":0}]
[{"$f":"AR15","v":0},{"$f":"CR122+CR123","v":0}]
[{"$f":"AS15","v":0},{"$f":"CS122+CS123","v":0}]
[{"$f":"AT15","v":0},{"$f":"CT122+CT123","v":0}]
[{"$f":"AU15","v":0},{"$f":"CU122+CU123","v":0}]
[{"$f":"AV15","v":0},{"$f":"CV122+CV123","v":0}]
[{"$f":"AW15","v":0},{"$f":"CW122+CW123","v":0}]
[{"$f":"AX15","v":0},{"$f":"CX122+CX123","v":0}]
[{"$f":"AY15","v":0},{"$f":"CY122+CY123","v":0}]
[]
[{"$f":"34-COUNTIF(A1037:A1071,\"0\")","v":7},"Sub-regions"]

{"sheet":"MICS12","index":5,"n_rows":1072,"n_cols":76,"rows_kept":1072,"cut":false,"hidden":false,"merged":[[346,52,347,52],[348,52,349,52],[350,52,351,52],[352,52,353,52],[152,52,159,52],[270,52,272,52],[273,52,275,52],[276,52,283,52],[338,54,338,58],[338,59,338,63],[338,64,338,68],[340,52,341,52],[342,52,343,52],[344,52,345,52],[221,52,223,52],[224,52,225,52],[226,52,229,52],[258,54,258,58],[258,59,258,63],[258,64,258,68],[260,52,262,52],[263,52,266,52],[267,52,269,52],[119,64,119,68],[121,52,122,52],[123,52,126,52],[127,52,128,52],[132,54,132,58],[132,59,132,63],[132,64,132,68],[134,52,138,52],[219,54,219,58],[219,59,219,63],[219,64,219,68],[139,52,142,52],[13,64,13,68],[15,52,16,52],[17,52,20,52],[21,52,22,52],[26,54,26,58],[26,59,26,63],[26,64,26,68],[40,52,41,52],[55,54,55,58],[55,59,55,63],[55,64,55,68],[143,0,146,0],[143,52,146,52],[147,0,149,0],[147,52,149,52],[150,0,151,0],[150,52,151,52],[13,54,13,58],[13,59,13,63],[119,54,119,58],[119,59,119,63],[42,52,43,52],[44,52,45,52],[46,0,48,0],[46,52,48,52],[49,0,51,0],[49,52,51,52],[52,0,54,0],[52,52,54,52],[32,52,33,52],[34,52,35,52],[36,52,37,52],[38,0,39,0],[38,52,39,52],[13,2,13,6],[13,7,13,11],[28,52,29,52],[30,0,31,0],[30,52,31,52],[26,2,26,6],[26,7,26,11],[26,12,26,16],[13,12,13,16],[15,0,16,0],[17,0,20,0],[21,0,22,0],[23,0,25,0],[32,0,33,0],[55,2,55,6],[55,7,55,11],[55,12,55,16],[28,0,29,0],[34,0,35,0],[36,0,37,0],[40,0,41,0],[42,0,43,0],[44,0,45,0],[139,0,142,0],[107,0,107,1],[119,2,119,6],[119,7,119,11],[57,0,64,0],[132,12,132,16],[134,0,138,0],[119,12,119,16],[121,0,122,0],[123,0,126,0],[127,0,128,0],[129,0,131,0],[152,0,158,0],[132,2,132,6],[132,7,132,11],[219,2,219,6],[219,7,219,11],[219,12,219,16],[207,0,207,1],[1024,0,1024,2],[1025,0,1025,1],[407,12,407,13],[408,2,408,3],[408,7,408,8],[408,12,408,13],[405,2,405,3],[405,7,405,8],[405,12,405,13],[406,2,406,3],[406,7,406,8],[406,12,406,13],[411,2,411,3],[411,7,411,8],[411,12,411,13],[412,2,412,3],[412,7,412,8],[1030,0,1032,0],[1033,0,1033,2],[398,2,398,5],[221,0,223,0],[398,7,398,10],[398,12,398,15],[399,2,399,4],[399,7,399,9],[399,12,399,14],[400,2,401,3],[400,7,401,8],[400,12,401,13],[401,1,444,1],[402,2,402,3],[402,7,402,8],[402,12,402,13],[403,2,403,3],[403,7,403,8],[403,12,403,13],[404,2,404,3],[404,7,404,8],[404,12,404,13],[407,2,407,3],[407,7,407,8],[412,12,412,13],[409,2,409,3],[409,7,409,8],[409,12,409,13],[410,2,410,3],[410,7,410,8],[410,12,410,13],[415,2,415,3],[415,7,415,8],[415,12,415,13],[416,2,416,3],[416,7,416,8],[416,12,416,13],[413,2,413,3],[413,7,413,8],[413,12,413,13],[414,2,414,3],[414,7,414,8],[414,12,414,13],[419,2,419,3],[419,7,419,8],[419,12,419,13],[420,2,420,3],[420,7,420,8],[420,12,420,13],[417,2,417,3],[417,7,417,8],[417,12,417,13],[418,2,418,3],[418,7,418,8],[418,12,418,13],[423,2,423,3],[423,7,423,8],[423,12,423,13],[424,2,424,3],[424,7,424,8],[424,12,424,13],[421,2,421,3],[421,7,421,8],[421,12,421,13],[422,2,422,3],[422,7,422,8],[422,12,422,13],[427,2,427,3],[427,7,427,8],[427,12,427,13],[428,2,428,3],[428,7,428,8],[428,12,428,13],[425,2,425,3],[425,7,425,8],[425,12,425,13],[426,2,426,3],[426,7,426,8],[426,12,426,13],[431,2,431,3],[431,7,431,8],[431,12,431,13],[432,2,432,3],[432,7,432,8],[432,12,432,13],[429,2,429,3],[429,7,429,8],[429,12,429,13],[430,2,430,3],[430,7,430,8],[430,12,430,13],[435,2,435,3],[435,7,435,8],[435,12,435,13],[436,2,436,3],[436,7,436,8],[436,12,436,13],[433,2,433,3],[433,7,433,8],[433,12,433,13],[434,2,434,3],[434,7,434,8],[434,12,434,13],[439,2,439,3],[439,7,439,8],[439,12,439,13],[440,2,440,3],[440,7,440,8],[440,12,440,13],[437,2,437,3],[437,7,437,8],[437,12,437,13],[438,2,438,3],[438,7,438,8],[438,12,438,13],[443,2,443,3],[443,7,443,8],[443,12,443,13],[444,2,444,3],[444,7,444,8],[444,12,444,13],[441,2,441,3],[441,7,441,8],[441,12,441,13],[442,2,442,3],[442,7,442,8],[442,12,442,13],[447,2,447,3],[447,7,447,8],[447,12,447,13],[448,2,448,3],[448,7,448,8],[448,12,448,13],[445,2,445,4],[445,7,445,8],[445,12,445,13],[446,2,446,3],[446,7,446,8],[446,12,446,13],[451,2,451,3],[451,7,451,8],[451,12,451,13],[452,2,452,3],[452,7,452,8],[452,12,452,13],[449,2,449,3],[449,7,449,8],[449,12,449,13],[450,2,450,3],[450,7,450,8],[450,12,450,13],[455,2,455,3],[455,7,455,9],[455,12,455,14],[456,2,456,3],[456,7,456,8],[456,12,456,13],[453,2,453,3],[453,7,453,8],[453,12,453,13],[454,2,454,3],[454,7,454,8],[454,12,454,13],[459,2,459,3],[459,7,459,8],[459,12,459,13],[460,2,460,3],[460,7,460,8],[460,12,460,13],[457,2,457,3],[457,7,457,8],[457,12,457,13],[458,2,458,3],[458,7,458,8],[458,12,458,13],[463,2,463,3],[463,7,463,8],[463,12,463,13],[464,2,464,3],[464,7,464,8],[464,12,464,13],[461,2,461,3],[461,7,461,8],[461,12,461,13],[462,2,462,3],[462,7,462,8],[462,12,462,13],[467,2,467,3],[467,7,467,8],[467,12,467,13],[468,2,468,3],[468,7,468,8],[468,12,468,13],[465,2,465,3],[465,7,465,8],[465,12,465,13],[466,2,466,3],[466,7,466,8],[466,12,466,13],[471,2,471,3],[471,7,471,8],[471,12,471,13],[472,2,472,3],[472,7,472,8],[472,12,472,13],[469,2,469,3],[469,7,469,8],[469,12,469,13],[470,2,470,3],[470,7,470,8],[470,12,470,13],[475,2,475,3],[475,7,475,8],[475,12,475,13],[476,2,476,3],[476,7,476,8],[476,12,476,13],[473,2,473,3],[473,7,473,8],[473,12,473,13],[474,2,474,3],[474,7,474,8],[474,12,474,13],[479,2,479,3],[479,7,479,8],[479,12,479,13],[480,2,480,3],[480,7,480,8],[480,12,480,13],[477,2,477,3],[477,7,477,8],[477,12,477,13],[478,2,478,3],[478,7,478,8],[478,12,478,13],[483,2,483,3],[483,7,483,8],[483,12,483,13],[484,2,484,3],[484,7,484,8],[484,12,484,13],[481,2,481,3],[481,7,481,8],[481,12,481,13],[482,2,482,3],[482,7,482,8],[482,12,482,13],[487,2,487,3],[487,7,487,8],[487,12,487,13],[488,2,488,3],[488,7,488,8],[488,12,488,13],[485,2,485,3],[485,7,485,8],[485,12,485,13],[486,2,486,3],[486,7,486,8],[486,12,486,13],[489,2,489,6],[489,7,489,8],[489,12,489,13],[490,2,491,3],[490,4,490,6],[490,7,490,8],[490,12,490,13],[491,7,491,8],[491,12,491,13],[494,2,494,3],[494,7,494,8],[494,12,494,13],[495,2,495,4],[495,7,495,8],[495,12,495,13],[492,2,492,3],[492,7,492,8],[492,12,492,13],[493,2,493,3],[493,7,493,8],[493,12,493,13],[499,2,499,3],[499,7,499,8],[499,12,499,13],[500,2,500,3],[500,7,500,8],[500,12,500,13],[496,2,497,3],[496,7,496,8],[496,12,496,13],[497,7,497,8],[497,12,497,13],[498,2,498,3],[498,7,498,8],[498,12,498,13],[503,2,503,3],[503,7,503,8],[503,12,503,13],[504,2,504,3],[504,7,504,8],[504,12,504,13],[501,2,501,3],[501,7,501,8],[501,12,501,13],[502,2,502,3],[502,7,502,8],[502,12,502,13],[507,2,507,3],[507,7,507,8],[507,12,507,13],[508,2,508,3],[508,7,508,8],[508,12,508,13],[505,2,505,3],[505,7,505,8],[505,12,505,13],[506,2,506,3],[506,7,506,8],[506,12,506,13],[509,2,509,3],[509,7,509,11],[509,12,509,16],[510,2,510,3],[510,7,511,8],[510,9,510,11],[510,12,511,13],[510,14,510,16],[511,2,511,3],[514,2,514,3],[514,7,514,8],[514,12,514,13],[515,2,515,3],[515,7,515,9],[515,12,515,14],[512,2,512,3],[512,7,512,8],[512,12,512,13],[513,2,513,3],[513,7,513,8],[513,12,513,13],[519,2,519,3],[519,7,519,8],[519,12,519,13],[520,2,520,3],[520,7,520,8],[520,12,520,13],[516,2,516,3],[516,7,517,8],[516,12,517,13],[517,2,517,3],[518,2,518,3],[518,7,518,8],[518,12,518,13],[523,2,523,3],[523,7,523,8],[523,12,523,13],[524,2,524,3],[524,7,524,8],[524,12,524,13],[521,2,521,3],[521,7,521,8],[521,12,521,13],[522,2,522,3],[522,7,522,8],[522,12,522,13],[527,2,527,3],[527,7,527,8],[527,12,527,13],[528,2,528,3],[528,7,528,8],[528,12,528,13],[525,2,525,3],[525,7,525,8],[525,12,525,13],[526,2,526,3],[526,7,526,8],[526,12,526,13],[531,2,531,3],[531,7,531,8],[531,12,531,13],[532,2,532,3],[532,7,532,8],[532,12,532,13],[529,2,529,3],[529,7,529,8],[529,12,529,13],[530,2,530,3],[530,7,530,8],[530,12,530,13],[535,2,535,3],[535,7,535,8],[535,12,535,13],[536,2,536,3],[536,7,536,8],[536,12,536,13],[533,2,533,3],[533,7,533,8],[533,12,533,13],[534,2,534,3],[534,7,534,8],[534,12,534,13],[539,2,539,3],[539,7,539,8],[539,12,539,13],[540,2,540,4],[540,7,540,8],[540,12,540,13],[537,2,537,3],[537,7,537,8],[537,12,537,13],[538,2,538,3],[538,7,538,8],[538,12,538,13],[543,2,543,3],[543,7,543,8],[543,12,543,13],[544,2,544,3],[544,7,544,8],[544,12,544,13],[541,2,541,3],[541,7,541,8],[541,12,541,13],[542,2,542,3],[542,7,542,8],[542,12,542,13],[547,2,547,3],[547,7,547,8],[547,12,547,13],[548,2,548,3],[548,7,548,8],[548,12,548,13],[545,2,545,3],[545,7,545,8],[545,12,545,13],[546,2,546,3],[546,7,546,8],[546,12,546,13],[551,2,551,3],[551,7,551,8],[551,12,551,13],[552,2,552,3],[552,7,552,8],[552,12,552,13],[549,2,549,3],[549,7,549,8],[549,12,549,13],[550,2,550,3],[550,7,550,8],[550,12,550,13],[555,2,555,3],[555,7,555,8],[555,12,555,13],[556,2,556,3],[556,7,556,8],[556,12,556,13],[553,2,553,3],[553,7,553,8],[553,12,553,13],[554,2,554,3],[554,7,554,8],[554,12,554,13],[559,2,559,3],[559,7,559,8],[559,12,559,13],[560,2,560,3],[560,7,560,8],[560,12,560,13],[557,2,557,3],[557,7,557,8],[557,12,557,13],[558,2,558,3],[558,7,558,8],[558,12,558,13],[563,2,563,3],[563,7,563,8],[563,12,563,13],[564,2,564,3],[564,7,564,8],[564,12,564,13],[561,2,561,3],[561,7,561,8],[561,12,561,13],[562,2,562,3],[562,7,562,8],[562,12,562,13],[567,2,567,3],[567,7,567,8],[567,12,567,13],[568,2,568,3],[568,7,568,8],[568,12,568,13],[565,2,565,3],[565,7,565,8],[565,12,565,13],[566,2,566,3],[566,7,566,8],[566,12,566,13],[571,2,571,3],[571,7,571,8],[571,12,571,13],[572,2,572,3],[572,7,572,8],[572,12,572,13],[569,2,569,3],[569,7,569,8],[569,12,569,13],[570,2,570,3],[570,7,570,9],[570,12,570,14],[575,2,575,3],[575,7,575,8],[575,12,575,13],[576,2,576,3],[576,7,576,8],[576,12,576,13],[573,2,573,3],[573,7,573,8],[573,12,573,13],[574,2,574,3],[574,7,574,8],[574,12,574,13],[579,2,579,3],[579,7,579,8],[579,12,579,13],[580,2,580,3],[580,7,580,8],[580,12,580,13],[577,2,577,3],[577,7,577,8],[577,12,577,13],[578,2,578,3],[578,7,578,8],[578,12,578,13],[583,2,583,3],[583,7,583,8],[583,12,583,13],[584,2,584,3],[584,7,584,8],[584,12,584,13],[581,2,581,3],[581,7,581,8],[581,12,581,13],[582,2,582,3],[582,7,582,8],[582,12,582,13],[587,2,587,3],[587,7,587,8],[587,12,587,13],[588,2,588,3],[588,7,588,8],[588,12,588,13],[585,2,585,3],[585,7,585,8],[585,12,585,13],[586,2,586,3],[586,7,586,8],[586,12,586,13],[591,2,591,3],[591,7,591,8],[591,12,591,13],[592,2,592,3],[592,7,592,8],[592,12,592,13],[589,2,589,3],[589,7,589,8],[589,12,589,13],[590,2,590,3],[590,7,590,8],[590,12,590,13],[595,2,595,3],[595,7,595,8],[595,12,595,13],[596,2,596,3],[596,7,596,8],[596,12,596,13],[593,2,593,3],[593,7,593,8],[593,12,593,13],[594,2,594,3],[594,7,594,8],[594,12,594,13],[599,2,599,3],[599,7,599,8],[599,12,599,13],[600,2,600,3],[600,7,600,8],[600,12,600,13],[597,2,597,3],[597,7,597,8],[597,12,597,13],[598,2,598,3],[598,7,598,8],[598,12,598,13],[603,2,603,3],[603,7,603,8],[603,12,603,13],[604,2,604,3],[604,7,604,8],[604,12,604,13],[601,2,601,3],[601,7,601,8],[601,12,601,13],[602,2,602,3],[602,7,602,8],[602,12,602,13],[607,2,607,3],[607,7,607,8],[607,12,607,13],[608,2,608,3],[608,7,608,8],[608,12,608,13],[605,2,605,3],[605,7,605,8],[605,12,605,13],[606,2,606,3],[606,7,606,8],[606,12,606,13],[611,2,611,3],[611,7,611,8],[611,12,611,13],[612,2,612,3],[612,7,612,8],[612,12,612,13],[609,2,609,3],[609,7,609,8],[609,12,609,13],[610,2,610,3],[610,7,610,8],[610,12,610,13],[615,2,615,3],[615,7,615,8],[615,12,615,13],[616,2,616,3],[616,7,616,8],[616,12,616,13],[613,2,613,3],[613,7,613,8],[613,12,613,13],[614,2,614,3],[614,7,614,8],[614,12,614,13],[619,2,619,3],[619,7,619,8],[619,12,619,13],[620,2,620,3],[620,7,620,8],[620,12,620,13],[617,2,617,3],[617,7,617,8],[617,12,617,13],[618,2,618,3],[618,7,618,8],[618,12,618,13],[623,2,623,3],[623,7,623,8],[623,12,623,13],[624,2,624,3],[624,7,624,8],[624,12,624,13],[621,2,621,3],[621,7,621,8],[621,12,621,13],[622,2,622,3],[622,7,622,8],[622,12,622,13],[627,2,627,3],[627,7,627,8],[627,12,627,13],[628,2,628,3],[628,7,628,8],[628,12,628,13],[625,2,625,3],[625,7,625,8],[625,12,625,13],[626,2,626,3],[626,7,626,8],[626,12,626,13],[631,2,631,3],[631,7,631,8],[631,12,631,13],[632,2,632,3],[632,7,632,8],[632,12,632,13],[629,2,629,3],[629,7,629,8],[629,12,629,13],[630,2,630,3],[630,7,630,8],[630,12,630,13],[635,2,635,3],[635,7,635,8],[635,12,635,13],[636,2,636,3],[636,7,636,8],[636,12,636,13],[633,2,633,3],[633,7,633,8],[633,12,633,13],[634,2,634,3],[634,7,634,8],[634,12,634,13],[639,2,639,3],[639,7,639,8],[639,12,639,13],[640,2,640,3],[640,7,640,8],[640,12,640,13],[637,2,637,3],[637,7,637,8],[637,12,637,13],[638,2,638,3],[638,7,638,8],[638,12,638,13],[643,2,643,3],[643,7,643,8],[643,12,643,13],[644,2,644,3],[644,7,644,8],[644,12,644,13],[641,2,641,3],[641,7,641,8],[641,12,641,13],[642,2,642,3],[642,7,642,8],[642,12,642,13],[647,2,647,3],[647,7,647,8],[647,12,647,13],[648,2,648,3],[648,7,648,8],[648,12,648,13],[645,2,645,3],[645,7,645,8],[645,12,645,13],[646,2,646,3],[646,7,646,8],[646,12,646,13],[651,2,651,3],[651,7,651,8],[651,12,651,13],[652,2,652,3],[652,7,652,8],[652,12,652,13],[649,2,649,3],[649,7,649,8],[649,12,649,13],[650,2,650,3],[650,7,650,8],[650,12,650,13],[655,2,655,3],[655,7,655,8],[655,12,655,13],[656,2,656,3],[656,7,656,8],[656,12,656,13],[653,2,653,3],[653,7,653,8],[653,12,653,13],[654,2,654,3],[654,7,654,8],[654,12,654,13],[659,2,659,3],[659,7,659,8],[659,12,659,13],[660,2,660,3],[660,7,660,8],[660,12,660,13],[657,2,657,3],[657,7,657,8],[657,12,657,13],[658,2,658,3],[658,7,658,8],[658,12,658,13],[663,2,663,3],[663,7,663,8],[663,12,663,13],[664,2,664,3],[664,7,664,8],[664,12,664,13],[661,2,661,3],[661,7,661,8],[661,12,661,13],[662,2,662,3],[662,7,662,8],[662,12,662,13],[667,2,667,3],[667,7,667,8],[667,12,667,13],[668,2,668,3],[668,7,668,8],[668,12,668,13],[665,2,665,3],[665,7,665,8],[665,12,665,13],[666,2,666,3],[666,7,666,8],[666,12,666,13],[671,2,671,3],[671,7,671,8],[671,12,671,13],[672,2,672,3],[672,7,672,8],[672,12,672,13],[669,2,669,3],[669,7,669,8],[669,12,669,13],[670,2,670,3],[670,7,670,8],[670,12,670,13],[675,2,675,3],[675,7,675,8],[675,12,675,13],[676,2,676,3],[676,7,676,8],[676,12,676,13],[673,2,673,3],[673,7,673,8],[673,12,673,13],[674,2,674,3],[674,7,674,8],[674,12,674,13],[679,2,679,3],[679,7,679,8],[679,12,679,13],[680,2,680,3],[680,7,680,8],[680,12,680,13],[677,2,677,3],[677,7,677,8],[677,12,677,13],[678,2,678,3],[678,7,678,8],[678,12,678,13],[683,2,683,3],[683,7,683,8],[683,12,683,13],[684,2,684,3],[684,7,684,8],[684,12,684,13],[681,2,681,3],[681,7,681,8],[681,12,681,13],[682,2,682,3],[682,7,682,8],[682,12,682,13],[687,2,687,3],[687,7,687,8],[687,12,687,13],[688,2,688,3],[688,7,688,8],[688,12,688,13],[685,2,685,3],[685,7,685,8],[685,12,685,13],[686,2,686,3],[686,7,686,8],[686,12,686,13],[691,2,691,3],[691,7,691,8],[691,12,691,13],[689,2,689,3],[689,7,689,8],[689,12,689,13],[690,2,690,3],[690,7,690,8],[690,12,690,13]]}
[]
[{"$f":"A1026","v":"Belarus"}]
[{"$f":"A1034","v":"2012"}]
["Use of drinking water sources"]
[" by wealth quintile and sub-national region"]
["Notes:"]
["WHO/UNICEF JMP customised wealth index excludes water,"]
[" sanitation and hygiene assets."]
["Survey used for analysis:",{"$f":"A1025","v":"MICS12"}]
[{"$f":"B1028","v":""}]
[{"$f":"B1027","v":""}]
[]
[]
["Use of drinking water sources",null,"NATIONAL wealth index quintile",null,null,null,null,"URBAN wealth index quintile",null,null,null,null,"RURAL wealth index quintile",null,null,null,null,"SUB-REGIONS:",null,null,null,null,null,null,null,null,null,null,null,null,null,null,null,null,null,null,null,null,null,null,null,null,null,null,null,null,null,null,null,null,null,null,"Raw numbers of respondents:","Use of drinking water sources","NATIONAL wealth index quintile",null,null,null,null,"URBAN wealth index quintile",null,null,null,null,"RURAL wealth index quintile",null,null,null,null,"SUB-REGIONS:"]
["Weighted percentage (used in graphs)",null,"Poorest","Poor","Middle","Rich","Richest","Poorest","Poor","Middle","Rich","Richest","Poorest","Poor","Middle","Rich","Richest","Brest region","Gomel region","Grodno region","Minsk city","Minsk region","Mogilev region","Vitebsk region",null,null,null,null,null,null,null,null,null,null,null,null,null,null,null,null,null,null,null,null,null,null,null,null,null,null,null,null,"Water data, raw numbers (weighted)",null,"Poorest","Poor","Middle","Rich","Richest","Poorest","Poor","Middle","Rich","Richest","Poorest","Poor","Middle","Rich","Richest","Brest region","Gomel region","Grodno region","Minsk city","Minsk region","Mogilev region","Vitebsk region"]
["Water","Improved",98.941110389847438,99.577495790156675,99.814908154647057,99.864516672544241,99.896315816451249,99.796039748657194,99.688424085306508,100,99.813098272245966,99.856809974862273,98.105715678449812,98.694271497738882,99.008206290331316,99.94784515496319,99.550508079031985,99.50143819137368,99.923504456998714,99.586991872496952,99.886273650945085,99.394256644801388,99.557061699203217,99.382995235631654,null,null,null,null,null,null,null,null,null,null,null,null,null,null,null,null,null,null,null,null,null,null,null,null,null,null,null,null,"Water","Improved","N/A","N/A","N/A","N/A","N/A","N/A","N/A","N/A","N/A","N/A","N/A","N/A","N/A","N/A","N/A","N/A","N/A","N/A","N/A","N/A","N/A","N/A"]
[null,"Not Improved",1.0588896101525833,0.42250420984330667,0.18509184535297249,0.13548332745576167,0.10368418354875912,0.20396025134280277,0.31157591469348206,0,0.18690172775403135,0.14319002513771814,1.8942843215501337,1.3057285022610912,0.99179370966867353,5.2154845036810255E-2,0.44949192096803148,0.49856180862631944,7.649554300126242E-2,0.41300812750304322,0.11372634905490518,0.60574335519863565,0.44293830079675056,0.61700476436835328,null,null,null,null,null,null,null,null,null,null,null,null,null,null,null,null,null,null,null,null,null,null,null,null,null,null,null,null,null,"Not Improved","N/A","N/A","N/A","N/A","N/A","N/A","N/A","N/A","N/A","N/A","N/A","N/A","N/A","N/A","N/A","N/A","N/A","N/A","N/A","N/A","N/A","N/A"]
["Water ladder","Basic",{"$f":"C16*C23/100","v":98.669675838816531},{"$f":"D16*D23/100","v":99.50174122144746},{"$f":"E16*E23/100","v":99.814908154647057},99.839657986820853,99.896315816451249,99.717055517031227,99.662855664411666,99.965702713867628,99.813098272245966,99.856809974862287,97.834176031037146,97.981125077332948,99.008206290331316,99.947845154963204,99.550508079031985,99.426577033444431,99.681712441762087,99.586991872496952,99.886273650945071,99.394256644801388,99.371054286420346,99.345560116791106,null,null,null,null,null,null,null,null,null,null,null,null,null,null,null,null,null,null,null,null,null,null,null,null,null,null,null,null,"Water ladder","Basic","N/A","N/A","N/A","N/A","N/A","N/A","N/A","N/A","N/A","N/A","N/A","N/A","N/A","N/A","N/A","N/A","N/A","N/A","N/A","N/A","N/A","N/A"]
[null,"Limited",{"$f":"C16*C22/100","v":0.27143455103091541},{"$f":"D16*D22/100","v":7.5754568709220885E-2},{"$f":"E16*E22/100","v":0},2.4858685723376985E-2,0,7.8984231625967419E-2,2.5568420894835558E-2,3.4297286132376807E-2,0,0,0.27153964741266728,0.71314642040594733,0,0,0,7.4861157929246649E-2,0.24179201523662944,0,0,0,0.18600741278289346,3.743511884053858E-2,null,null,null,null,null,null,null,null,null,null,null,null,null,null,null,null,null,null,null,null,null,null,null,null,null,null,null,null,null,"Limited","N/A","N/A","N/A","N/A","N/A","N/A","N/A","N/A","N/A","N/A","N/A","N/A","N/A","N/A","N/A","N/A","N/A","N/A","N/A","N/A","N/A","N/A"]
[null,"Unimproved",{"$f":"100-C18-C19-C21","v":1.058889610152554},{"$f":"100-D18-D19-D21","v":0.42250420984331877},{"$f":"100-E18-E19-E21","v":0.1850918453529431},0.13548332745576966,0.10368418354875075,0.20396025134280565,0.31157591469349877,-5.2111093218343285E-15,0.18690172775403369,0.14319002513771295,1.8942843215501872,1.3057285022611049,0.99179370966868419,5.2154845036795905E-2,0.44949192096801482,0.49856180862632216,7.6495543001283112E-2,0.41300812750304772,0.11372634905492873,0.60574335519861222,0.44293830079676044,0.61700476436835583,null,null,null,null,null,null,null,null,null,null,null,null,null,null,null,null,null,null,null,null,null,null,null,null,null,null,null,null,null,"Unimproved","N/A","N/A","N/A","N/A","N/A","N/A","N/A","N/A","N/A","N/A","N/A","N/A","N/A","N/A","N/A","N/A","N/A","N/A","N/A","N/A","N/A","N/A"]
[null,"Surface water",0,0,0,0,0,0,0,0,0,0,0,0,0,0,0,0,0,0,0,0,0,0,null,null,null,null,null,null,null,null,null,null,null,null,null,null,null,null,null,null,null,null,null,null,null,null,null,null,null,null,null,"Surface water","N/A","N/A","N/A","N/A","N/A","N/A","N/A","N/A","N/A","N/A","N/A","N/A","N/A","N/A","N/A","N/A","N/A","N/A","N/A","N/A","N/A","N/A"]
["Improved water point at more than 30 minutes","Yes",0.27433950353034231,7.6075992982251012E-2,0,2.4892410789798963E-2,0,7.9145657307538794E-2,2.564833492899422E-2,3.4297286132376807E-2,0,0,0.27678269867849759,0.72258137132334554,0,0,0,7.5236257173754872E-2,0.24197711694617627,0,0,0,0.18683497645288794,3.766752929088317E-2,null,null,null,null,null,null,null,null,null,null,null,null,null,null,null,null,null,null,null,null,null,null,null,null,null,null,null,null,"Improved water point at more than 30 minutes","Yes","N/A","N/A","N/A","N/A","N/A","N/A","N/A","N/A","N/A","N/A","N/A","N/A","N/A","N/A","N/A","N/A","N/A","N/A","N/A","N/A","N/A","N/A"]
[null,"No",99.725660496469658,99.92392400701776,100,99.975107589210197,100,99.920854342692465,99.974351665070998,99.965702713867628,100,100,99.723217301321512,99.277418628676656,100,100,100,99.924763742826244,99.758022883053826,100,100,100,99.813165023547128,99.962332470709114,null,null,null,null,null,null,null,null,null,null,null,null,null,null,null,null,null,null,null,null,null,null,null,null,null,null,null,null,null,"No","N/A","N/A","N/A","N/A","N/A","N/A","N/A","N/A","N/A","N/A","N/A","N/A","N/A","N/A","N/A","N/A","N/A","N/A","N/A","N/A","N/A","N/A"]
["Manually calculated ratios","Improved wells"]
[null,"Improved springs"]
[null,"Other"]
[null,null,"NATIONAL wealth index quintile",null,null,null,null,"URBAN wealth index quintile",null,null,null,null,"RURAL wealth index quintile",null,null,null,null,"SUB-REGIONS:",null,null,null,null,null,null,null,null,null,null,null,null,null,null,null,null,null,null,null,null,null,null,null,null,null,null,null,null,null,null,null,null,null,null,"Raw numbers of respondents:","Use of drinking water sources","NATIONAL wealth index quintile",null,null,null,null,"URBAN wealth index quintile",null,null,null,null,"RURAL wealth index quintile",null,null,null,null,"SUB-REGIONS:"]
["Percentage based on weighted population",null,"Poorest","Poor","Middle","Rich","Richest","Poorest","Poor","Middle","Rich","Richest","Poorest","Poor","Middle","Rich","Richest","Brest region","Gomel region","Grodno region","Minsk city","Minsk region","Mogilev region","Vitebsk region",null,null,null,null,null,null,null,null,null,null,null,null,null,null,null,null,null,null,null,null,null,null,null,null,null,null,null,null,"Water data, raw numbers (weighted)",null,"Poorest","Poor","Middle","Rich","Richest","Poorest","Poor","Middle","Rich","Richest","Poorest","Poor","Middle","Rich","Richest","Brest region","Gomel region","Grodno region","Minsk city","Minsk region","Mogilev region","Vitebsk region"]
["Piped water","Yes",60.177162302121104,87.572136430473336,96.694280903837722,99.391798806169902,99.720843055663295,87.994528293570497,98.431789009178146,99.832314314391567,99.602317258220907,99.856809974862273,32.844611942913076,56.545491470324514,69.510866869379484,84.149282060727884,89.662829907575542,78.512960277152359,85.956387695591388,85.75145482117874,99.886273650945085,85.392072070138724,93.654437833389949,90.269807232510686,null,null,null,null,null,null,null,null,null,null,null,null,null,null,null,null,null,null,null,null,null,null,null,null,null,null,null,null,"Piped water","Yes","N/A","N/A","N/A","N/A","N/A","N/A","N/A","N/A","N/A","N/A","N/A","N/A","N/A","N/A","N/A","N/A","N/A","N/A","N/A","N/A","N/A","N/A"]
[null,"No",39.822837697879166,12.427863569526572,3.3057190961623037,0.60820119383007842,0.27915694433669064,12.005471706429557,1.5682109908218806,0.16768568560842848,0.39768274177907365,0.14319002513771814,67.155388057086896,43.454508529675394,30.489133130620576,15.8507179392721,10.337170092424444,21.487039722847722,14.043612304408532,14.248545178821384,0.11372634905490518,14.607927929861422,6.3455621666099926,9.7301927674893562,null,null,null,null,null,null,null,null,null,null,null,null,null,null,null,null,null,null,null,null,null,null,null,null,null,null,null,null,null,"No","N/A","N/A","N/A","N/A","N/A","N/A","N/A","N/A","N/A","N/A","N/A","N/A","N/A","N/A","N/A","N/A","N/A","N/A","N/A","N/A","N/A","N/A"]
["Piped water on premises","Yes",47.451010517147346,84.823190196738452,96.53153467227294,99.253050107288587,99.720843055663295,78.524362293297571,97.827382671383177,99.640884088394031,99.602317258220907,99.856809974862273,18.166585642084883,47.200954105943786,65.717719067633112,82.120012726746822,89.26028175358735,77.372678283962784,82.627515794089661,84.837475598056173,99.886273650945085,82.51420839660301,84.398375308579787,83.766287930921905,null,null,null,null,null,null,null,null,null,null,null,null,null,null,null,null,null,null,null,null,null,null,null,null,null,null,null,null,"Piped water on premises","Yes","N/A","N/A","N/A","N/A","N/A","N/A","N/A","N/A","N/A","N/A","N/A","N/A","N/A","N/A","N/A","N/A","N/A","N/A","N/A","N/A","N/A","N/A"]
[null,"No",52.548989482852946,15.176809803261515,3.4684653277270781,0.74694989271140766,0.27915694433669064,21.475637706702528,2.1726173286168509,0.35911591160597078,0.39768274177907365,0.14319002513771814,81.833414357915046,52.799045894056128,34.282280932366966,17.87998727325315,10.739718246412625,22.627321716037326,17.372484205910258,15.162524401943955,0.11372634905490518,17.485791603397203,15.601624691420184,16.233712069078152,null,null,null,null,null,null,null,null,null,null,null,null,null,null,null,null,null,null,null,null,null,null,null,null,null,null,null,null,null,"No","N/A","N/A","N/A","N/A","N/A","N/A","N/A","N/A","N/A","N/A","N/A","N/A","N/A","N/A","N/A","N/A","N/A","N/A","N/A","N/A","N/A","N/A"]
["Piped water into dwelling","Yes","N/A","N/A","N/A","N/A","N/A","N/A","N/A","N/A","N/A","N/A","N/A","N/A","N/A","N/A","N/A","N/A","N/A","N/A","N/A","N/A","N/A","N/A",null,null,null,null,null,null,null,null,null,null,null,null,null,null,null,null,null,null,null,null,null,null,null,null,null,null,null,null,"Piped water into dwelling","Yes","N/A","N/A","N/A","N/A","N/A","N/A","N/A","N/A","N/A","N/A","N/A","N/A","N/A","N/A","N/A","N/A","N/A","N/A","N/A","N/A","N/A","N/A"]
[null,"No","N/A","N/A","N/A","N/A","N/A","N/A","N/A","N/A","N/A","N/A","N/A","N/A","N/A","N/A","N/A","N/A","N/A","N/A","N/A","N/A","N/A","N/A",null,null,null,null,null,null,null,null,null,null,null,null,null,null,null,null,null,null,null,null,null,null,null,null,null,null,null,null,null,"No","N/A","N/A","N/A","N/A","N/A","N/A","N/A","N/A","N/A","N/A","N/A","N/A","N/A","N/A","N/A","N/A","N/A","N/A","N/A","N/A","N/A","N/A"]
["Water source on premises","Yes",78.815234594969823,95.886841170098378,99.184371112051181,99.660293621130563,99.743587283397446,89.210094172749848,98.737667029816151,99.774272487870093,99.602317258220907,99.856809974862273,66.968925422902643,82.397124038933896,93.195979108804977,96.073286983081246,98.144621019520756,97.998776348416939,91.892410033934652,97.69062644480023,99.886273650945085,94.195359833731757,87.344294375799009,91.128149985175085,null,null,null,null,null,null,null,null,null,null,null,null,null,null,null,null,null,null,null,null,null,null,null,null,null,null,null,null,"Water source on premises","Yes","N/A","N/A","N/A","N/A","N/A","N/A","N/A","N/A","N/A","N/A","N/A","N/A","N/A","N/A","N/A","N/A","N/A","N/A","N/A","N/A","N/A","N/A"]
[null,"No",21.184765405030344,4.1131588299015789,0.81562888794884014,0.33970637886942173,0.2564127166025551,10.789905827250164,1.262332970183867,0.22572751212991912,0.39768274177907365,0.14319002513771814,33.031074577097222,17.602875961066029,6.8040208911950337,3.9267130169187641,1.855378980479315,2.0012236515831265,8.1075899660652126,2.3093735551998309,0.11372634905490518,5.8046401662682863,12.655705624200994,8.8718500148249753,null,null,null,null,null,null,null,null,null,null,null,null,null,null,null,null,null,null,null,null,null,null,null,null,null,null,null,null,null,"No","N/A","N/A","N/A","N/A","N/A","N/A","N/A","N/A","N/A","N/A","N/A","N/A","N/A","N/A","N/A","N/A","N/A","N/A","N/A","N/A","N/A","N/A"]
["Improved Water source on premises","Yes",79.2,96,99.4,99.8,99.8,89.3,99,99.8,99.8,100,67.3,83.2,93.2,96.1,98.6,98.3,91.9,97.9,100,94.7,87.7,91.1,null,null,null,null,null,null,null,null,null,null,null,null,null,null,null,null,null,null,null,null,null,null,null,null,null,null,null,null,"Improved water source on premises","Yes","N/A","N/A","N/A","N/A","N/A","N/A","N/A","N/A","N/A","N/A","N/A","N/A","N/A","N/A","N/A","N/A","N/A","N/A","N/A","N/A","N/A","N/A"]
[null,"No",20.8,4,0.6,0.2,0.2,10.7,1,0.2,0.2,0,32.700000000000003,16.8,6.8,3.9,1.4,1.7,8.1,2.1,0,5.3,12.3,8.9,null,null,null,null,null,null,null,null,null,null,null,null,null,null,null,null,null,null,null,null,null,null,null,null,null,null,null,null,null,"No","N/A","N/A","N/A","N/A","N/A","N/A","N/A","N/A","N/A","N/A","N/A","N/A","N/A","N/A","N/A","N/A","N/A","N/A","N/A","N/A","N/A","N/A"]
["Piped water on premises available when needed","Yes","N/A","N/A","N/A","N/A","N/A","N/A","N/A","N/A","N/A","N/A","N/A","N/A","N/A","N/A","N/A","N/A","N/A","N/A","N/A","N/A","N/A","N/A",null,null,null,null,null,null,null,null,null,null,null,null,null,null,null,null,null,null,null,null,null,null,null,null,null,null,null,null,"Piped water on premises available when needed","Yes","N/A","N/A","N/A","N/A","N/A","N/A","N/A","N/A","N/A","N/A","N/A","N/A","N/A","N/A","N/A","N/A","N/A","N/A","N/A","N/A","N/A","N/A"]
[null,"No","N/A","N/A","N/A","N/A","N/A","N/A","N/A","N/A","N/A","N/A","N/A","N/A","N/A","N/A","N/A","N/A","N/A","N/A","N/A","N/A","N/A","N/A",null,null,null,null,null,null,null,null,null,null,null,null,null,null,null,null,null,null,null,null,null,null,null,null,null,null,null,null,null,"No","N/A","N/A","N/A","N/A","N/A","N/A","N/A","N/A","N/A","N/A","N/A","N/A","N/A","N/A","N/A","N/A","N/A","N/A","N/A","N/A","N/A","N/A"]
["Water point at more than 30 minutes","Yes",0.45259631741766454,9.9967305555872063E-2,3.7113618453252853E-2,2.4858685723376989E-2,0,7.8984155334790696E-2,0.1103140036741535,3.4297286132376807E-2,0,0,0.27149199965837456,1.3685645236899906,0,0,0,0.15505897317077785,0.24179173199993151,0,0,0,0.49917924882087311,3.7434663320867347E-2,null,null,null,null,null,null,null,null,null,null,null,null,null,null,null,null,null,null,null,null,null,null,null,null,null,null,null,null,"Water point at more than 30 minutes","Yes","N/A","N/A","N/A","N/A","N/A","N/A","N/A","N/A","N/A","N/A","N/A","N/A","N/A","N/A","N/A","N/A","N/A","N/A","N/A","N/A","N/A","N/A"]
[null,"No",99.547403682582342,99.900032694444135,99.962886381546738,99.975141314276613,100,99.92101584466522,99.889685996325852,99.965702713867628,100,100,99.728508000341634,98.631435476309989,100,100,100,99.844941026829233,99.758208268000075,100,100,100,99.50082075117912,99.962565336679134,null,null,null,null,null,null,null,null,null,null,null,null,null,null,null,null,null,null,null,null,null,null,null,null,null,null,null,null,null,"No","N/A","N/A","N/A","N/A","N/A","N/A","N/A","N/A","N/A","N/A","N/A","N/A","N/A","N/A","N/A","N/A","N/A","N/A","N/A","N/A","N/A","N/A"]
["Water source available when needed","Yes","N/A","N/A","N/A","N/A","N/A","N/A","N/A","N/A","N/A","N/A","N/A","N/A","N/A","N/A","N/A","N/A","N/A","N/A","N/A","N/A","N/A","N/A",null,null,null,null,null,null,null,null,null,null,null,null,null,null,null,null,null,null,null,null,null,null,null,null,null,null,null,null,"Water source available when needed","Yes","N/A","N/A","N/A","N/A","N/A","N/A","N/A","N/A","N/A","N/A","N/A","N/A","N/A","N/A","N/A","N/A","N/A","N/A","N/A","N/A","N/A","N/A"]
[null,"No","N/A","N/A","N/A","N/A","N/A","N/A","N/A","N/A","N/A","N/A","N/A","N/A","N/A","N/A","N/A","N/A","N/A","N/A","N/A","N/A","N/A","N/A",null,null,null,null,null,null,null,null,null,null,null,null,null,null,null,null,null,null,null,null,null,null,null,null,null,null,null,null,null,"No","N/A","N/A","N/A","N/A","N/A","N/A","N/A","N/A","N/A","N/A","N/A","N/A","N/A","N/A","N/A","N/A","N/A","N/A","N/A","N/A","N/A","N/A"]
["Improved water source available when needed","Yes","N/A","N/A","N/A","N/A","N/A","N/A","N/A","N/A","N/A","N/A","N/A","N/A","N/A","N/A","N/A","N/A","N/A","N/A","N/A","N/A","N/A","N/A",null,null,null,null,null,null,null,null,null,null,null,null,null,null,null,null,null,null,null,null,null,null,null,null,null,null,null,null,"Improved water source available when needed","Yes","N/A","N/A","N/A","N/A","N/A","N/A","N/A","N/A","N/A","N/A","N/A","N/A","N/A","N/A","N/A","N/A","N/A","N/A","N/A","N/A","N/A","N/A"]
[null,"No","N/A","N/A","N/A","N/A","N/A","N/A","N/A","N/A","N/A","N/A","N/A","N/A","N/A","N/A","N/A","N/A","N/A","N/A","N/A","N/A","N/A","N/A",null,null,null,null,null,null,null,null,null,null,null,null,null,null,null,null,null,null,null,null,null,null,null,null,null,null,null,null,null,"No","N/A","N/A","N/A","N/A","N/A","N/A","N/A","N/A","N/A","N/A","N/A","N/A","N/A","N/A","N/A","N/A","N/A","N/A","N/A","N/A","N/A","N/A"]
["Microbiological quality at point of collection","Not contaminated (No E. coli in 100 mL)","N/A","N/A","N/A","N/A","N/A","N/A","N/A","N/A","N/A","N/A","N/A","N/A","N/A","N/A","N/A","N/A","N/A","N/A","N/A","N/A","N/A","N/A",null,null,null,null,null,null,null,null,null,null,null,null,null,null,null,null,null,null,null,null,null,null,null,null,null,null,null,null,"Microbiological quality at point of collection","Not contaminated (No E. coli in 100 mL)","N/A","N/A","N/A","N/A","N/A","N/A","N/A","N/A","N/A","N/A","N/A","N/A","N/A","N/A","N/A","N/A","N/A","N/A","N/A","N/A","N/A","N/A"]
[null,"Contaminated (E. coli detected in 100 mL)","N/A","N/A","N/A","N/A","N/A","N/A","N/A","N/A","N/A","N/A","N/A","N/A","N/A","N/A","N/A","N/A","N/A","N/A","N/A","N/A","N/A","N/A",null,null,null,null,null,null,null,null,null,null,null,null,null,null,null,null,null,null,null,null,null,null,null,null,null,null,null,null,null,"Contaminated (E. coli detected in 100 mL)","N/A","N/A","N/A","N/A","N/A","N/A","N/A","N/A","N/A","N/A","N/A","N/A","N/A","N/A","N/A","N/A","N/A","N/A","N/A","N/A","N/A","N/A"]
[null,"Highly contaminated (>100 CFU/100 mL)","N/A","N/A","N/A","N/A","N/A","N/A","N/A","N/A","N/A","N/A","N/A","N/A","N/A","N/A","N/A","N/A","N/A","N/A","N/A","N/A","N/A","N/A",null,null,null,null,null,null,null,null,null,null,null,null,null,null,null,null,null,null,null,null,null,null,null,null,null,null,null,null,null,"Highly contaminated (>100 CFU/100 mL)","N/A","N/A","N/A","N/A","N/A","N/A","N/A","N/A","N/A","N/A","N/A","N/A","N/A","N/A","N/A","N/A","N/A","N/A","N/A","N/A","N/A","N/A"]
["Microbiological quality of improved water sources at point of collection","Not contaminated (No E. coli in 100 mL)","N/A","N/A","N/A","N/A","N/A","N/A","N/A","N/A","N/A","N/A","N/A","N/A","N/A","N/A","N/A","N/A","N/A","N/A","N/A","N/A","N/A","N/A",null,null,null,null,null,null,null,null,null,null,null,null,null,null,null,null,null,null,null,null,null,null,null,null,null,null,null,null,"Microbiological quality of improved water sources at point of collection","Not contaminated (No E. coli in 100 mL)","N/A","N/A","N/A","N/A","N/A","N/A","N/A","N/A","N/A","N/A","N/A","N/A","N/A","N/A","N/A","N/A","N/A","N/A","N/A","N/A","N/A","N/A"]
[null,"Contaminated (E. coli detected in 100 mL)","N/A","N/A","N/A","N/A","N/A","N/A","N/A","N/A","N/A","N/A","N/A","N/A","N/A","N/A","N/A","N/A","N/A","N/A","N/A","N/A","N/A","N/A",null,null,null,null,null,null,null,null,null,null,null,null,null,null,null,null,null,null,null,null,null,null,null,null,null,null,null,null,null,"Contaminated (E. coli detected in 100 mL)","N/A","N/A","N/A","N/A","N/A","N/A","N/A","N/A","N/A","N/A","N/A","N/A","N/A","N/A","N/A","N/A","N/A","N/A","N/A","N/A","N/A","N/A"]
[null,"Highly contaminated (>100 CFU/100 mL)","N/A","N/A","N/A","N/A","N/A","N/A","N/A","N/A","N/A","N/A","N/A","N/A","N/A","N/A","N/A","N/A","N/A","N/A","N/A","N/A","N/A","N/A",null,null,null,null,null,null,null,null,null,null,null,null,null,null,null,null,null,null,null,null,null,null,null,null,null,null,null,null,null,"Highly contaminated (>100 CFU/100 mL)","N/A","N/A","N/A","N/A","N/A","N/A","N/A","N/A","N/A","N/A","N/A","N/A","N/A","N/A","N/A","N/A","N/A","N/A","N/A","N/A","N/A","N/A"]
["Microbiological quality of piped on premises at point of collection","Not contaminated (No E. coli in 100 mL)","N/A","N/A","N/A","N/A","N/A","N/A","N/A","N/A","N/A","N/A","N/A","N/A","N/A","N/A","N/A","N/A","N/A","N/A","N/A","N/A","N/A","N/A",null,null,null,null,null,null,null,null,null,null,null,null,null,null,null,null,null,null,null,null,null,null,null,null,null,null,null,null,"Microbiological quality of piped on premises at point of collection","Not contaminated (No E. coli in 100 mL)","N/A","N/A","N/A","N/A","N/A","N/A","N/A","N/A","N/A","N/A","N/A","N/A","N/A","N/A","N/A","N/A","N/A","N/A","N/A","N/A","N/A","N/A"]
[null,"Contaminated (E. coli detected in 100 mL)","N/A","N/A","N/A","N/A","N/A","N/A","N/A","N/A","N/A","N/A","N/A","N/A","N/A","N/A","N/A","N/A","N/A","N/A","N/A","N/A","N/A","N/A",null,null,null,null,null,null,null,null,null,null,null,null,null,null,null,null,null,null,null,null,null,null,null,null,null,null,null,null,null,"Contaminated (E. coli detected in 100 mL)","N/A","N/A","N/A","N/A","N/A","N/A","N/A","N/A","N/A","N/A","N/A","N/A","N/A","N/A","N/A","N/A","N/A","N/A","N/A","N/A","N/A","N/A"]
[null,"Highly contaminated (>100 CFU/100 mL)","N/A","N/A","N/A","N/A","N/A","N/A","N/A","N/A","N/A","N/A","N/A","N/A","N/A","N/A","N/A","N/A","N/A","N/A","N/A","N/A","N/A","N/A",null,null,null,null,null,null,null,null,null,null,null,null,null,null,null,null,null,null,null,null,null,null,null,null,null,null,null,null,null,"Highly contaminated (>100 CFU/100 mL)","N/A","N/A","N/A","N/A","N/A","N/A","N/A","N/A","N/A","N/A","N/A","N/A","N/A","N/A","N/A","N/A","N/A","N/A","N/A","N/A","N/A","N/A"]
[null,null,"NATIONAL wealth index quintile",null,null,null,null,"URBAN wealth index quintile",null,null,null,null,"RURAL wealth index quintile",null,null,null,null,"SUB-REGIONS:",null,null,null,null,null,null,null,null,null,null,null,null,null,null,null,null,null,null,null,null,null,null,null,null,null,null,null,null,null,null,null,null,null,null,"Raw numbers of respondents:","Use of drinking water sources","NATIONAL wealth index quintile",null,null,null,null,"URBAN wealth index quintile",null,null,null,null,"RURAL wealth index quintile",null,null,null,null,"SUB-REGIONS:"]
["Percentage based on weighted population",null,"Poorest","Poor","Middle","Rich","Richest","Poorest","Poor","Middle","Rich","Richest","Poorest","Poor","Middle","Rich","Richest","Brest region","Gomel region","Grodno region","Minsk city","Minsk region","Mogilev region","Vitebsk region",null,null,null,null,null,null,null,null,null,null,null,null,null,null,null,null,null,null,null,null,null,null,null,null,null,null,null,null,"Water data, raw numbers (weighted)",null,"Poorest","Poor","Middle","Rich","Richest","Poorest","Poor","Middle","Rich","Richest","Poorest","Poor","Middle","Rich","Richest","Brest region","Gomel region","Grodno region","Minsk city","Minsk region","Mogilev region","Vitebsk region"]
["Main source of drinking water","Piped into dwelling",45.328079231869069,82.060555619392034,94.604975957803902,95.747100439037851,94.244630812838025,75.884335723387267,95.17330404920213,96.487450507188981,96.264803719936182,93.548980587102577,16.242732270183353,44.988241119053384,63.020601579805856,80.423989116318026,88.037441916775265,74.838649110533481,77.789008018942866,84.221431441842739,92.936701954913147,80.710772500858027,81.881493228123219,82.731408687359959]
[null,"Piped into compound, yard or plot",2.0884698554874523,0.83390212332264158,2.2782186243958044E-2,1.702665508148286E-2,0,1.449946829898614,3.1483963980138453E-2,0,0,0,1.9238533719015234,2.2127129868904136,1.6477713145481827,1.0053750655498861,6.1817213058550126E-2,0.30539499999421171,0.60786612812617546,0.12058743892363995,0,0.63590872890939165,1.9903565016999267,0.8483582854184798]
[null,"Public tap / standpipe",12.70418514259249,2.7489462337349337,0.16274623156477386,0.13874869888132915,0,9.4398719396084179,0.60440633779497022,0.19143022599754231,0,0,14.678026300828176,9.3445373643807432,3.7931478017463944,2.0292693339810541,0.40254815398818172,1.1402819931895931,3.3288719015017163,0.91397922312257274,0,2.8493751036064863,9.25606252481019,6.5035193015888089]
[null,"Tube well, Borehole",5.5276348209022368,3.9952027891941522,1.0989340469639897,0.47271786637431673,2.2744227734135543E-2,2.6379216110515191,0.21525531453052799,0.16768568560842848,0,0,5.2409571543263507,6.7757617975196718,9.7492675367881994,5.9923309555695212,4.6387139660870691,7.5377275315547152,3.1780260000154916,4.0872944406855231E-2,0,1.4505175677030544,2.5815844297956017,0.49228059611723213]
[null,"Protected well",33.236313266824332,8.010156570489114,1.8822558665451683,0,0.15272853305379594,9.1635898440352328,1.0413797615978704,0,0.21078101402504226,0,60.020146581210362,35.37301822989464,19.7480718841637,9.8062321386657665,4.7425691369806815,13.450750382666662,10.789090761391789,13.544116495727271,0,12.551667006959732,3.3210394360176405,8.6209074070037666]
[null,"Unprotected well",0.70271848572863649,6.9090781900841253E-2,0,0,0,7.5456709068728561E-2,0,0,0,0,1.595302507247234,0.65031039897704801,0.30529874626256959,5.2154845036810255E-2,0,0.15360202252250346,3.4240355368409942E-2,0.41300812750304322,0,0.230197002497596,0,0.33252084091762496]
[null,"Bottled water",5.6428072172090941E-2,1.928732454023754,2.0432138655253067,3.4889230131692885,5.4762122428252891,1.2203738006761722,2.6225946582008888,3.1534335812050109,3.3375135382847185,6.3078293877596874,0,0,1.0493461732790699,0.69064854487890892,1.6674176921421879,2.2286341734351214,4.230641647020585,0.74600432847399256,6.9495716960320708,1.1960157367648367,0.52652557875664097,0.1865209581434758]
[null,"Other",0.35617112442394683,0.35341342794246539,0.18509184535297249,0.13548332745576167,0.10368418354875912,0.12850354227407418,0.31157591469348206,0,0.18690172775403135,0.14319002513771814,0.29898181430289955,0.65541810328404315,0.68649496340610394,0,0.44949192096803148,0.344959786103816,4.2255187632852471E-2,0,0.11372634905490518,0.37554635270103959,0.44293830079675056,0.28448392345072837]
[]
[]
[]
[]
[]
[]
[]
[]
[]
[]
[]
[]
[]
[]
[]
[]
[]
[]
[]
[]
[]
[]
[]
[]
[]
[]
[]
[]
[]
[]
[]
[]
[]
[]
[]
[]
[]
[]
[]
[]
[]
[]
[{"$f":"A1026","v":"Belarus"}]
[{"$f":"A1034","v":"2012"}]
["Use of sanitation facilities"]
[" by wealth quintile and sub-national region"]
["Notes:"]
["WHO/UNICEF JMP customised wealth index excludes water,"]
[" sanitation and hygiene assets."]
["Survey used for analysis:",{"$f":"A1025","v":"MICS12"}]
[{"$f":"B1030","v":""}]
[{"$f":"B1029","v":""}]
[]
[]
["Use of sanitation facilities",null,"NATIONAL wealth index quintile",null,null,null,null,"URBAN wealth index quintile",null,null,null,null,"RURAL wealth index quintile",null,null,null,null,"SUB-REGIONS:",null,null,null,null,null,null,null,null,null,null,null,null,null,null,null,null,null,null,null,null,null,null,null,null,null,null,null,null,null,null,null,null,null,null,"Raw numbers of respondents:","Use of sanitation facilities","NATIONAL wealth index quintile",null,null,null,null,"URBAN wealth index quintile",null,null,null,null,"RURAL wealth index quintile",null,null,null,null,"SUB-REGIONS:"]
["Weighted percentage (used in graphs)",null,"Poorest","Poor","Middle","Rich","Richest","Poorest","Poor","Middle","Rich","Richest","Poorest","Poor","Middle","Rich","Richest","Brest region","Gomel region","Grodno region","Minsk city","Minsk region","Mogilev region","Vitebsk region",null,null,null,null,null,null,null,null,null,null,null,null,null,null,null,null,null,null,null,null,null,null,null,null,null,null,null,null,"Sanitation data, raw numbers (weighted)",null,"Poorest","Poor","Middle","Rich","Richest","Poorest","Poor","Middle","Rich","Richest","Poorest","Poor","Middle","Rich","Richest","Brest region","Gomel region","Grodno region","Minsk city","Minsk region","Mogilev region","Vitebsk region"]
["Sanitation","Improved",94.409774493805244,98.097487477745673,99.599450231672577,100,100,97.544268834531209,99.352595620765868,100,100,100,91.710819367666844,94.309864420185562,95.838389953326541,97.871155706408132,99.785164358837847,99.774718968217257,94.704251331452895,99.805178332135242,100,96.797567762501842,99.974518161194268,98.287426810417614,null,null,null,null,null,null,null,null,null,null,null,null,null,null,null,null,null,null,null,null,null,null,null,null,null,null,null,null,"Sanitation","Improved",3851.6465420814784,4001.7524847354357,4063.5939631558131,4078.7121987191531,4080.4391812656609,2885.6085249924608,2933.1790469338112,2956.2521160631827,2956.6206105066753,2954.6541710778224,1030.3343342988717,1060.5395109453559,1077.798443037306,1100.1489832408383,1121.0086288612217,3112.6794805714144,2910.4681105711479,2266.1844476287542,3720.1317772510456,3044.9975059449607,2354.3598969070595,2667.3231510831611]
[null,"Not Improved",5.5902255061948045,1.9025125222543335,0.40054976832745337,0,0,2.4557311654687917,0.64740437923413707,0,0,0,8.2891806323330659,5.6901355798143971,4.1616100466734975,2.1288442935918948,0.21483564116216436,0.22528103178274173,5.2957486685470725,0.19482166786475622,0,3.2024322374981802,2.5481838805739235E-2,1.7125731895824015,null,null,null,null,null,null,null,null,null,null,null,null,null,null,null,null,null,null,null,null,null,null,null,null,null,null,null,null,null,"Not Improved",228.06507965765459,77.610389510727558,16.342174748282901,0,0,72.646797918873062,19.11326974597791,0,0,0,93.125625390596326,63.987088117767605,46.801462660396233,23.929888925587068,2.4135111574668571,7.0281094473988892,162.74990198129484,4.4236365402500413,0,100.74011570275496,0.60008710706614188,46.475793137900162]
["Sanitation ladder","Basic",{"$f":"C122*C129/100","v":90.897229613136531},{"$f":"D122*D129/100","v":94.678493158590285},{"$f":"E122*E129/100","v":96.005037073079436},97.908392398127319,99.061608512875495,92.254890241527704,94.894534453225077,96.983447678956267,98.351529948603044,99.115036721985405,89.011527567835088,92.307809438648917,93.822619283606841,96.039262294542738,99.360249417560894,97.750852341209196,93.41724469742681,98.983041724487563,96.375047532654705,94.763206038989395,92.918823463771773,95.831107107883795,null,null,null,null,null,null,null,null,null,null,null,null,null,null,null,null,null,null,null,null,null,null,null,null,null,null,null,null,"Sanitation ladder","Basic",3708.3448403660345,3862.279299807225,3916.9442017527917,3993.4015443122348,4042.1486873513718,2729.1352012160019,2801.5640496116193,2867.0752242401745,2907.8816052090428,2928.5065666714568,1000.0088717325807,1038.0258701501079,1055.1290879865562,1079.5570564374507,1116.2350403346691,3049.540759796786,2870.9155908715134,2247.516947352593,3585.278768603087,2981.0018238480288,2188.2011101885532,2600.6635729291042]
[null,"Limited",{"$f":"C122*C128/100","v":3.5125448806687194},{"$f":"D122*D128/100","v":3.4189943191554484},{"$f":"E122*E128/100","v":3.5944131585931278},2.0916076018726688,0.93839148712448539,5.2893785930034927,4.4580611675407997,3.016552321043716,1.6484700513969615,0.88496327801458952,2.6992917998317463,2.0020549815366371,2.0157706697196995,1.8318934118654113,0.42491494127695156,2.0238666270080774,1.2870066340260879,0.82213660764769214,3.6249524673454347,2.0343617235124771,7.055694697422485,2.4563197025338708,null,null,null,null,null,null,null,null,null,null,null,null,null,null,null,null,null,null,null,null,null,null,null,null,null,null,null,null,null,"Limited",143.30170171544464,139.47318492821273,146.64976140302105,85.310654406917678,38.290493914289009,156.47332377645844,131.61499732219232,89.176891823007907,48.739005297632538,26.147604406365094,30.325462566290881,22.513640795247799,22.669355050749669,20.591926803387761,4.7735885265526825,63.138720774628737,39.552519699634644,18.667500276161306,134.85300864796335,63.995682096932867,166.15878671850606,66.659578154058082]
[null,"Unimproved",{"$f":"100-C124-C125-C127","v":5.5902255061947494},{"$f":"100-D124-D125-D127","v":1.9025125222542663},{"$f":"100-E124-E125-E127","v":0.40054976832743661},1.2434497875801753E-14,1.9984014443252818E-14,2.4557311654688032,0.64740437923412308,1.6875389974302379E-14,-5.773159728050814E-15,5.773159728050814E-15,8.2891806323331654,5.690135579814446,4.1616100466734594,2.1288442935918512,0.21483564116215453,0.22528103178272652,5.2957486685471018,0.19482166786474453,-1.3944401189291966E-13,3.2024322374981278,2.5481838805742285E-2,1.7125731895823337,null,null,null,null,null,null,null,null,null,null,null,null,null,null,null,null,null,null,null,null,null,null,null,null,null,null,null,null,null,"Unimproved",228.06507965765459,77.610389510727558,16.342174748282901,0,0,72.646797918873062,19.11326974597791,0,0,0,93.125625390596326,63.987088117767605,46.801462660396233,23.929888925587068,2.4135111574668571,7.0281094473988892,162.74990198129484,4.4236365402500413,0,100.74011570275496,0.60008710706614188,46.475793137900162]
[null,"Open defecation",0,0,0,0,0,0,0,0,0,0,0,0,0,0,0,0,0,0,0,0,0,0,null,null,null,null,null,null,null,null,null,null,null,null,null,null,null,null,null,null,null,null,null,null,null,null,null,null,null,null,null,"Open defecation",716.20520008728272,2112.3233258430678,3645.869742773506,4017.5742080944447,4070.9146748439775,1215.3812724469071,2676.5140698404493,2924.1248013534018,2955.8463821337496,2954.6541710778224,55.887117907849053,179.00413016281163,307.82809686591344,485.92489887538608,807.72221097798786,1988.8710922845917,1868.5136258024691,1792.8366991626096,3708.9545483517613,1902.3647488487525,1364.7436943424941,1936.6027428496031]
["Shared among Improved Sanitation","Yes",3.7205309508489477,3.4853026382873251,3.6088684729005727,2.0916076018726688,0.93839148712448528,5.4225416379675844,4.4871109201388721,3.016552321043716,1.6484700513969612,0.88496327801458952,2.9432642936165898,2.1228479055136127,2.1033018925937541,1.8717398386105577,0.42582977540520267,2.028436309254622,1.3589745084639628,0.82374143444917913,3.6249524673454347,2.1016661580835332,7.0574930764319479,2.4991189435366539,null,null,null,null,null,null,null,null,null,null,null,null,null,null,null,null,null,null,null,null,null,null,null,null,null,null,null,null,"Shared among improved sanitation facilities","Yes","N/A","N/A","N/A","N/A","N/A","N/A","N/A","N/A","N/A","N/A","N/A","N/A","N/A","N/A","N/A","N/A","N/A","N/A","N/A","N/A","N/A","N/A"]
[null,"No",96.279469049151061,96.514697361712734,96.391131527099418,97.908392398127319,99.061608512875509,94.577458362032402,95.512889079861139,96.983447678956267,98.351529948603044,99.11503672198539,97.056735706383407,97.877152094486377,97.896698107406237,98.128260161389449,99.574170224594809,97.971563690745384,98.641025491536041,99.176258565550825,96.37504753265469,97.898333841916497,92.942506923568047,97.500881056463399,null,null,null,null,null,null,null,null,null,null,null,null,null,null,null,null,null,null,null,null,null,null,null,null,null,null,null,null,null,"No","N/A","N/A","N/A","N/A","N/A","N/A","N/A","N/A","N/A","N/A","N/A","N/A","N/A","N/A","N/A","N/A","N/A","N/A","N/A","N/A","N/A","N/A"]
["Manually calculated ratios","Improved latrines"]
[null,"Other"]
[null,"Other"]
[null,null,"NATIONAL wealth index quintile",null,null,null,null,"URBAN wealth index quintile",null,null,null,null,"RURAL wealth index quintile",null,null,null,null,"SUB-REGIONS:",null,null,null,null,null,null,null,null,null,null,null,null,null,null,null,null,null,null,null,null,null,null,null,null,null,null,null,null,null,null,null,null,null,null,"Raw numbers of respondents:","Use of sanitation facilities","NATIONAL wealth index quintile",null,null,null,null,"URBAN wealth index quintile",null,null,null,null,"RURAL wealth index quintile",null,null,null,null,"SUB-REGIONS:"]
["Percentage based on weighted population",null,"Poorest","Poor","Middle","Rich","Richest","Poorest","Poor","Middle","Rich","Richest","Poorest","Poor","Middle","Rich","Richest","Brest region","Gomel region","Grodno region","Minsk city","Minsk region","Mogilev region","Vitebsk region",null,null,null,null,null,null,null,null,null,null,null,null,null,null,null,null,null,null,null,null,null,null,null,null,null,null,null,null,"Sanitation data, raw numbers (weighted)",null,"Poorest","Poor","Middle","Rich","Richest","Poorest","Poor","Middle","Rich","Richest","Poorest","Poor","Middle","Rich","Richest","Brest region","Gomel region","Grodno region","Minsk city","Minsk region","Mogilev region","Vitebsk region"]
["Sanitation type","Sewer connection",17.555289846245877,51.780716522636141,89.360951238967843,98.501046711657963,99.766581340915153,41.084394001894445,90.658843459326363,98.913241717943706,99.973813739572321,100,4.9745536034320779,15.918176618671822,27.372232142855896,43.228719167976912,71.898370363659666,63.751843238378555,60.799904795904339,78.95843900418204,99.699547500773107,60.474361744521701,57.951884686220133,71.361319782864925,null,null,null,null,null,null,null,null,null,null,null,null,null,null,null,null,null,null,null,null,null,null,null,null,null,null,null,null,"Sanitation type","Sewer connection","N/A","N/A","N/A","N/A","N/A","N/A","N/A","N/A","N/A","N/A","N/A","N/A","N/A","N/A","N/A","N/A","N/A","N/A","N/A","N/A","N/A","N/A"]
[null,"Septic tank connection",7.3683794112313237,14.21983693173555,3.9815086635002781,0.91115157738944175,0.23341865908486345,8.6832741180906829,3.8565828064563963,0.79850546915039722,2.6186260427669916E-2,0,0.91831719117177124,11.350826609768887,16.615740694720685,21.36269998346706,11.549788043512253,9.9207183933570366,3.6143836260595372,0.29386006652196561,0.12280114250224011,11.356798402768014,8.273065047436102,3.9030020386303335,null,null,null,null,null,null,null,null,null,null,null,null,null,null,null,null,null,null,null,null,null,null,null,null,null,null,null,null,null,"Septic tank connection","N/A","N/A","N/A","N/A","N/A","N/A","N/A","N/A","N/A","N/A","N/A","N/A","N/A","N/A","N/A","N/A","N/A","N/A","N/A","N/A","N/A","N/A"]
[null,"Improved latrines",69.486105236328228,32.096934023373954,6.2569903292045135,0.58780171095260147,0,47.776600714546142,4.8371693549832244,0.28825281290590804,0,0,85.817948573062978,67.040861191744824,51.850417115749948,33.279736554964025,16.337005951665876,26.10215733648192,30.289962909488889,20.552879261431318,0.17765135672465404,24.966407615212262,33.749568427538037,23.023104988922363,null,null,null,null,null,null,null,null,null,null,null,null,null,null,null,null,null,null,null,null,null,null,null,null,null,null,null,null,null,"Improved latrines","N/A","N/A","N/A","N/A","N/A","N/A","N/A","N/A","N/A","N/A","N/A","N/A","N/A","N/A","N/A","N/A","N/A","N/A","N/A","N/A","N/A","N/A"]
[null,"Unimproved facilities",5.5902255061948045,1.9025125222543335,0.40054976832745337,0,0,2.4557311654687917,0.64740437923413707,0,0,0,8.2891806323330659,5.6901355798143971,4.1616100466734975,2.1288442935918948,0.21483564116216436,0.22528103178274173,5.2957486685470725,0.19482166786475622,0,3.2024322374981802,2.5481838805739235E-2,1.7125731895824015,null,null,null,null,null,null,null,null,null,null,null,null,null,null,null,null,null,null,null,null,null,null,null,null,null,null,null,null,null,"Unimproved facilities","N/A","N/A","N/A","N/A","N/A","N/A","N/A","N/A","N/A","N/A","N/A","N/A","N/A","N/A","N/A","N/A","N/A","N/A","N/A","N/A","N/A","N/A"]
[null,"Open defecation",0,0,0,0,0,0,0,0,0,0,0,0,0,0,0,0,0,0,0,0,0,0,null,null,null,null,null,null,null,null,null,null,null,null,null,null,null,null,null,null,null,null,null,null,null,null,null,null,null,null,null,"Open defecation","N/A","N/A","N/A","N/A","N/A","N/A","N/A","N/A","N/A","N/A","N/A","N/A","N/A","N/A","N/A","N/A","N/A","N/A","N/A","N/A","N/A","N/A"]
["Septic tank emptying practices","Not emptied/treated and disposed in situ","N/A","N/A","N/A","N/A","N/A","N/A","N/A","N/A","N/A","N/A","N/A","N/A","N/A","N/A","N/A","N/A","N/A","N/A","N/A","N/A","N/A","N/A",null,null,null,null,null,null,null,null,null,null,null,null,null,null,null,null,null,null,null,null,null,null,null,null,null,null,null,null,"Septic tank emptying practices","Not emptied/treated and disposed in situ","N/A","N/A","N/A","N/A","N/A","N/A","N/A","N/A","N/A","N/A","N/A","N/A","N/A","N/A","N/A","N/A","N/A","N/A","N/A","N/A","N/A","N/A"]
[null,"Emptied and buried on site","N/A","N/A","N/A","N/A","N/A","N/A","N/A","N/A","N/A","N/A","N/A","N/A","N/A","N/A","N/A","N/A","N/A","N/A","N/A","N/A","N/A","N/A",null,null,null,null,null,null,null,null,null,null,null,null,null,null,null,null,null,null,null,null,null,null,null,null,null,null,null,null,null,"Emptied and buried on site","N/A","N/A","N/A","N/A","N/A","N/A","N/A","N/A","N/A","N/A","N/A","N/A","N/A","N/A","N/A","N/A","N/A","N/A","N/A","N/A","N/A","N/A"]
[null,"Emptied and discharged locally","N/A","N/A","N/A","N/A","N/A","N/A","N/A","N/A","N/A","N/A","N/A","N/A","N/A","N/A","N/A","N/A","N/A","N/A","N/A","N/A","N/A","N/A",null,null,null,null,null,null,null,null,null,null,null,null,null,null,null,null,null,null,null,null,null,null,null,null,null,null,null,null,null,"Emptied and discharged locally","N/A","N/A","N/A","N/A","N/A","N/A","N/A","N/A","N/A","N/A","N/A","N/A","N/A","N/A","N/A","N/A","N/A","N/A","N/A","N/A","N/A","N/A"]
[null,"Emptied and removed offsite","N/A","N/A","N/A","N/A","N/A","N/A","N/A","N/A","N/A","N/A","N/A","N/A","N/A","N/A","N/A","N/A","N/A","N/A","N/A","N/A","N/A","N/A",null,null,null,null,null,null,null,null,null,null,null,null,null,null,null,null,null,null,null,null,null,null,null,null,null,null,null,null,null,"Emptied and removed offsite","N/A","N/A","N/A","N/A","N/A","N/A","N/A","N/A","N/A","N/A","N/A","N/A","N/A","N/A","N/A","N/A","N/A","N/A","N/A","N/A","N/A","N/A"]
["Latrine emptying practices","Not emptied/treated and disposed in situ","N/A","N/A","N/A","N/A","N/A","N/A","N/A","N/A","N/A","N/A","N/A","N/A","N/A","N/A","N/A","N/A","N/A","N/A","N/A","N/A","N/A","N/A",null,null,null,null,null,null,null,null,null,null,null,null,null,null,null,null,null,null,null,null,null,null,null,null,null,null,null,null,"Latrine emptying practices","Not emptied/treated and disposed in situ","N/A","N/A","N/A","N/A","N/A","N/A","N/A","N/A","N/A","N/A","N/A","N/A","N/A","N/A","N/A","N/A","N/A","N/A","N/A","N/A","N/A","N/A"]
[null,"Emptied and buried on site","N/A","N/A","N/A","N/A","N/A","N/A","N/A","N/A","N/A","N/A","N/A","N/A","N/A","N/A","N/A","N/A","N/A","N/A","N/A","N/A","N/A","N/A",null,null,null,null,null,null,null,null,null,null,null,null,null,null,null,null,null,null,null,null,null,null,null,null,null,null,null,null,null,"Emptied and buried on site","N/A","N/A","N/A","N/A","N/A","N/A","N/A","N/A","N/A","N/A","N/A","N/A","N/A","N/A","N/A","N/A","N/A","N/A","N/A","N/A","N/A","N/A"]
[null,"Emptied and discharged locally","N/A","N/A","N/A","N/A","N/A","N/A","N/A","N/A","N/A","N/A","N/A","N/A","N/A","N/A","N/A","N/A","N/A","N/A","N/A","N/A","N/A","N/A",null,null,null,null,null,null,null,null,null,null,null,null,null,null,null,null,null,null,null,null,null,null,null,null,null,null,null,null,null,"Emptied and discharged locally","N/A","N/A","N/A","N/A","N/A","N/A","N/A","N/A","N/A","N/A","N/A","N/A","N/A","N/A","N/A","N/A","N/A","N/A","N/A","N/A","N/A","N/A"]
[null,"Emptied and removed offsite","N/A","N/A","N/A","N/A","N/A","N/A","N/A","N/A","N/A","N/A","N/A","N/A","N/A","N/A","N/A","N/A","N/A","N/A","N/A","N/A","N/A","N/A",null,null,null,null,null,null,null,null,null,null,null,null,null,null,null,null,null,null,null,null,null,null,null,null,null,null,null,null,null,"Emptied and removed offsite","N/A","N/A","N/A","N/A","N/A","N/A","N/A","N/A","N/A","N/A","N/A","N/A","N/A","N/A","N/A","N/A","N/A","N/A","N/A","N/A","N/A","N/A"]
["Shared among improved sanitation facilities","Yes",3.5125448806687194,3.4189943191554479,3.5944131585931278,2.0916076018726688,0.93839148712448528,5.2893785930034927,4.4580611675407997,3.016552321043716,1.6484700513969612,0.88496327801458952,2.6992917998317463,2.0020549815366371,2.0157706697196991,1.8318934118654113,0.42491494127695156,2.0238666270080774,1.2870066340260879,0.82213660764769225,3.6249524673454347,2.0343617235124771,7.0556946974224859,2.4563197025338703,null,null,null,null,null,null,null,null,null,null,null,null,null,null,null,null,null,null,null,null,null,null,null,null,null,null,null,null,"Shared among improved sanitation facilities","Yes","N/A","N/A","N/A","N/A","N/A","N/A","N/A","N/A","N/A","N/A","N/A","N/A","N/A","N/A","N/A","N/A","N/A","N/A","N/A","N/A","N/A","N/A"]
[null,"No",90.897229613136545,94.678493158590271,96.00503707307945,97.908392398127319,99.061608512875509,92.254890241527704,94.894534453225106,96.983447678956267,98.351529948603044,99.11503672198539,89.011527567835074,92.307809438648917,93.822619283606826,96.039262294542738,99.360249417560894,97.750852341209196,93.41724469742681,98.983041724487563,96.37504753265469,94.763206038989395,92.918823463771773,95.831107107883781,null,null,null,null,null,null,null,null,null,null,null,null,null,null,null,null,null,null,null,null,null,null,null,null,null,null,null,null,null,"No","N/A","N/A","N/A","N/A","N/A","N/A","N/A","N/A","N/A","N/A","N/A","N/A","N/A","N/A","N/A","N/A","N/A","N/A","N/A","N/A","N/A","N/A"]
[null,"DK/missing",5.5902255061948045,1.9025125222543335,0.40054976832745337,0,0,2.4557311654687917,0.64740437923413707,0,0,0,8.2891806323330659,5.6901355798143971,4.1616100466734975,2.1288442935918948,0.21483564116216436,0.22528103178274173,5.2957486685470725,0.19482166786475622,0,3.2024322374981802,2.5481838805739235E-2,1.7125731895824015,null,null,null,null,null,null,null,null,null,null,null,null,null,null,null,null,null,null,null,null,null,null,null,null,null,null,null,null,null,"DK/missing","N/A","N/A","N/A","N/A","N/A","N/A","N/A","N/A","N/A","N/A","N/A","N/A","N/A","N/A","N/A","N/A","N/A","N/A","N/A","N/A","N/A","N/A"]
["Shared among all sanitation facilities","Yes",4.2536534258142504,3.6709533938926397,3.5944131585931278,2.0916076018726688,0.93839148712448528,6.0674865941969216,4.4890286949576277,3.016552321043716,1.6484700513969612,0.88496327801458952,2.8100264292614132,2.9576805905862718,2.2754076751175618,1.980507734432968,0.42491494127695156,2.0238666270080774,1.5631129376715465,0.82213660764769225,3.6249524673454347,2.7859618737440561,7.0556946974224859,2.7652850763085786,null,null,null,null,null,null,null,null,null,null,null,null,null,null,null,null,null,null,null,null,null,null,null,null,null,null,null,null,"Shared among all sanitation facilities","Yes","N/A","N/A","N/A","N/A","N/A","N/A","N/A","N/A","N/A","N/A","N/A","N/A","N/A","N/A","N/A","N/A","N/A","N/A","N/A","N/A","N/A","N/A"]
[null,"No",95.746346574185765,96.329046606107397,96.405586841406887,97.908392398127319,99.061608512875509,93.932513405803093,95.510971305042403,96.983447678956267,98.351529948603044,99.11503672198539,97.189973570738573,97.042319409413707,97.724592324882451,98.019492265567038,99.575085058723062,97.976133372991939,98.436887062328438,99.177863392352307,96.37504753265469,97.214038126255943,92.944305302577519,97.23471492369147,null,null,null,null,null,null,null,null,null,null,null,null,null,null,null,null,null,null,null,null,null,null,null,null,null,null,null,null,null,"No","N/A","N/A","N/A","N/A","N/A","N/A","N/A","N/A","N/A","N/A","N/A","N/A","N/A","N/A","N/A","N/A","N/A","N/A","N/A","N/A","N/A","N/A"]
["Type of toilet facility","Flush to piped sewer system",17.555289846245877,51.780716522636141,89.360951238967843,98.501046711657963,99.766581340915153,41.084394001894445,90.658843459326363,98.913241717943706,99.973813739572321,100,4.9745536034320779,15.918176618671822,27.372232142855896,43.228719167976912,71.898370363659666,63.751843238378555,60.799904795904339,78.95843900418204,99.699547500773107,60.474361744521701,57.951884686220133,71.361319782864925,null,null,null,null,null,null,null,null,null,null,null,null,null,null,null,null,null,null,null,null,null,null,null,null,null,null,null,null,"Type of toilet facility","Flush to piped sewer system",716.20520008728272,2112.3233258430678,3645.869742773506,4017.5742080944447,4070.9146748439775,1215.3812724469071,2676.5140698404493,2924.1248013534018,2955.8463821337496,2954.6541710778224,55.887117907849053,179.00413016281163,307.82809686591344,485.92489887538608,807.72221097798786,1988.8710922845917,1868.5136258024691,1792.8366991626096,3708.9545483517613,1902.3647488487525,1364.7436943424941,1936.6027428496031]
[null,"Flush to septic tank",7.3683794112313237,14.21983693173555,3.9815086635002781,0.91115157738944175,0.23341865908486345,8.6832741180906829,3.8565828064563963,0.79850546915039722,2.6186260427669916E-2,0,0.91831719117177124,11.350826609768887,16.615740694720685,21.36269998346706,11.549788043512253,9.9207183933570366,3.6143836260595372,0.29386006652196561,0.12280114250224011,11.356798402768014,8.273065047436102,3.9030020386303335,null,null,null,null,null,null,null,null,null,null,null,null,null,null,null,null,null,null,null,null,null,null,null,null,null,null,null,null,null,"Flush to septic tank",300.60863117383769,580.0787485715648,162.44301079593018,37.163250535805147,9.5245064216836859,256.87341880139979,113.85759788140595,23.605834828638862,0.77422837292544222,0,10.316925945759845,127.64306444038615,186.8606041838035,240.13359703845359,129.75287600604796,309.49740470195195,111.07788863880786,6.6724104265921644,4.5683643250531745,357.25507997056025,194.82737131857942,105.91962811727647]
[null,"Flush to pit (latrine)",4.8961250452482359,7.3495347761581566,3.3602592916853253,0.58780171095260147,0,7.9150989245968155,2.311013585361223,0.25326406531307244,0,0,2.6347026528476456,5.0253559597829058,6.3782129618409416,8.4376838063068469,8.7306825752677408,1.6102162337357224,10.022128220198839,1.9010967983459772,0.14984708383780657,4.6874057806936129,3.5173374353123323,0.86118827323962754,null,null,null,null,null,null,null,null,null,null,null,null,null,null,null,null,null,null,null,null,null,null,null,null,null,null,null,null,null,"Flush to pit (latrine)",199.74778248587256,299.81419308840668,137.09643316874974,23.974740088903655,0,234.14883525058301,68.227876518045491,7.4871242900453456,0,0,29.59982936161953,56.511464465362728,71.72937695406182,94.846220966903104,98.082421025311589,50.234038059568412,308.00184970425238,43.166457591121869,5.5745089831342574,147.45348712256879,82.831889104354147,23.370918266932598]
[null,"Ventilated Improved Pit latrine (VIP)",7.2629254594174988,4.5058532999220642,0.60256664116005332,0,0,4.4767743117770706,0.64403330620269061,0,0,0,10.896720712566916,6.319058099344506,8.4028040860335178,4.0687164072425057,1.7392752378683181,9.8304490117881418,2.1539264122172352,5.0880928736928836E-2,0,3.3325520226277932,0.7433949693613181,0.30692889743420643,null,null,null,null,null,null,null,null,null,null,null,null,null,null,null,null,null,null,null,null,null,null,null,null,null,null,null,null,null,"Ventilated Improved Pit latrine (VIP)",296.30641404610589,183.81010668501631,24.584334147643904,0,0,132.43441437287242,19.013745815880853,0,0,0,122.4202941248783,71.059489137381647,94.497926827495576,45.735581502181851,19.53940309807539,306.68126395368409,66.194854477384681,1.1553064812009761,0,104.83334273678436,17.50665405163311,8.3294331780788369]
[null,"Pit latrine with slab",57.327054731662486,20.24154594729373,2.2941643963591334,0,0,35.384727478172266,1.8821224634193126,3.4988747592835621E-2,0,0,72.28652520764841,55.696447132617408,37.069400067875506,20.773336341414648,5.8670481385298183,14.661492090958006,18.113908277072806,18.600901534348427,2.7804272886847458E-2,16.946449811890847,29.48883602286438,21.854987818248521,null,null,null,null,null,null,null,null,null,null,null,null,null,null,null,null,null,null,null,null,null,null,null,null,null,null,null,null,null,"Pit latrine with slab",2338.7785142883868,825.72611054737922,93.600442269985606,0,0,1046.7705841207005,55.56575687803273,1.0343555910972089,0,0,812.11016695876469,626.32136273941342,416.88243820603179,233.5086848579119,65.911717753798314,457.39568157162489,556.67989194822951,422.35357396723168,1.0343555910972089,533.09084726629874,694.45028808999859,593.10042867126992]
[null,"Pit latrine without slab / Open pit",4.849665146517852,1.68032165582091,0.32900605743508826,0,0,2.117250532681989,0.54853416578664427,0,0,0,7.6843921453330939,4.3140578191410173,3.5396412497452325,2.1288442935918948,0.21483564116216436,0.22528103178274173,5.2007688232131928,0.19482166786475622,0,3.2024322374981802,2.5481838805739235E-2,0.26527736618977271,null,null,null,null,null,null,null,null,null,null,null,null,null,null,null,null,null,null,null,null,null,null,null,null,null,null,null,null,null,"Pit latrine without slab / Open pit",197.85235259792088,68.5464177954766,13.423237033187666,0,0,62.633676582433509,16.194332030882673,0,0,0,86.331068898339907,48.512727675203259,39.806802156671843,23.929888925587068,2.4135111574668571,7.0281094473988892,159.8309642661996,4.4236365402500413,0,100.74011570275496,0.60008710706614188,7.1990943629154902]
[null,"Other",0.74056035967695155,0.22219086643342359,7.154371089236515E-2,0,0,0.33848063278680196,9.887021344749268E-2,0,0,0,0.60478848699997045,1.3760777606733781,0.62196879692826379,0,0,0,9.4979845333879404E-2,0,0,0,0,1.4472958233926285,null,null,null,null,null,null,null,null,null,null,null,null,null,null,null,null,null,null,null,null,null,null,null,null,null,null,null,null,null,"Other",30.212727059733702,9.0639717152509629,2.9189377150952338,0,0,10.013121336439534,2.9189377150952338,0,0,0,6.7945564922564179,15.474360442564334,6.9946605037243845,0,0,0,2.9189377150952338,0,0,0,0,39.276698774984666]
[null,null,null,null,null,null,null,null,null,null,null,null,null,null,null,null,null,null,null,null,null,null,null,null,null,null,null,null,null,null,null,null,null,null,null,null,null,null,null,null,null,null,null,null,null,null,null,null,null,null,null,null,null,"Total",4079.7116217391313,4079.3628742461633,4079.9361379040947,4078.7121987191531,4080.4391812656609,2958.2553229113337,2952.2923166797887,2956.2521160631827,2956.6206105066753,2954.6541710778224,1123.4599596894691,1124.526599063124,1124.5999056977018,1124.0788721664251,1123.4221400186884,3119.7075900188133,3073.2180125524437,2270.6080841690041,3720.1317772510456,3145.7376216477151,2354.9599840141254,2713.798944221061]
[]
[]
[]
[]
[]
[]
[]
[]
[]
[]
[]
[]
[]
[]
[]
[]
[]
[]
[]
[]
[]
[]
[]
[]
[]
[]
[]
[]
[]
[]
[]
[]
[]
[]
[]
[]
[]
[]
[]
[]
[]
[]
[]
[]
[]
[]
[]
[{"$f":"A1026","v":"Belarus"}]
[{"$f":"A1034","v":"2012"}]
["Access to hygiene facilities "]
[" by wealth quintile and sub-national region"]
["Notes:"]
["WHO/UNICEF JMP customised wealth index excludes water,"]
[" sanitation and hygiene assets."]
["Survey used for analysis:",{"$f":"A1025","v":"MICS12"}]
[]
[]
[]
[]
["Access to handwashing",null,"NATIONAL wealth index quintile",null,null,null,null,"URBAN wealth index quintile",null,null,null,null,"RURAL wealth index quintile",null,null,null,null,"SUB-REGIONS:",null,null,null,null,null,null,null,null,null,null,null,null,null,null,null,null,null,null,null,null,null,null,null,null,null,null,null,null,null,null,null,null,null,null,"Raw numbers of respondents:","Access to handwashing","NATIONAL wealth index quintile",null,null,null,null,"URBAN wealth index quintile",null,null,null,null,"RURAL wealth index quintile",null,null,null,null,"SUB-REGIONS:"]
["Weighted percentage (used in graphs)",null,"Poorest","Poor","Middle","Rich","Richest","Poorest","Poor","Middle","Rich","Richest","Poorest","Poor","Middle","Rich","Richest","Brest region","Gomel region","Grodno region","Minsk city","Minsk region","Mogilev region","Vitebsk region",null,null,null,null,null,null,null,null,null,null,null,null,null,null,null,null,null,null,null,null,null,null,null,null,null,null,null,null,"Hygiene data, raw numbers (weighted)",null,"Poorest","Poor","Middle","Rich","Richest","Poorest","Poor","Middle","Rich","Richest","Poorest","Poor","Middle","Rich","Richest","Brest region","Gomel region","Grodno region","Minsk city","Minsk region","Mogilev region","Vitebsk region"]
["Hygiene ladder","Basic","N/A","N/A","N/A","N/A","N/A","N/A","N/A","N/A","N/A","N/A","N/A","N/A","N/A","N/A","N/A","N/A","N/A","N/A","N/A","N/A","N/A","N/A",null,null,null,null,null,null,null,null,null,null,null,null,null,null,null,null,null,null,null,null,null,null,null,null,null,null,null,null,"Hygiene ladder","Basic","N/A","N/A","N/A","N/A","N/A","N/A","N/A","N/A","N/A","N/A","N/A","N/A","N/A","N/A","N/A","N/A","N/A","N/A","N/A","N/A","N/A","N/A"]
[null,"Limited","N/A","N/A","N/A","N/A","N/A","N/A","N/A","N/A","N/A","N/A","N/A","N/A","N/A","N/A","N/A","N/A","N/A","N/A","N/A","N/A","N/A","N/A",null,null,null,null,null,null,null,null,null,null,null,null,null,null,null,null,null,null,null,null,null,null,null,null,null,null,null,null,null,"Limited","N/A","N/A","N/A","N/A","N/A","N/A","N/A","N/A","N/A","N/A","N/A","N/A","N/A","N/A","N/A","N/A","N/A","N/A","N/A","N/A","N/A","N/A"]
[null,"No facility","N/A","N/A","N/A","N/A","N/A","N/A","N/A","N/A","N/A","N/A","N/A","N/A","N/A","N/A","N/A","N/A","N/A","N/A","N/A","N/A","N/A","N/A",null,null,null,null,null,null,null,null,null,null,null,null,null,null,null,null,null,null,null,null,null,null,null,null,null,null,null,null,null,"No facility","N/A","N/A","N/A","N/A","N/A","N/A","N/A","N/A","N/A","N/A","N/A","N/A","N/A","N/A","N/A","N/A","N/A","N/A","N/A","N/A","N/A","N/A"]
[null,null,null,null,null,null,null,null,null,null,null,null,null,null,null,null,null,null,null,null,null,null,null,null,null,null,null,null,null,null,null,null,null,null,null,null,null,null,null,null,null,null,null,null,null,null,null,null,null,null,null,null,"Observed handwashing place","Fixed","N/A","N/A","N/A","N/A","N/A","N/A","N/A","N/A","N/A","N/A","N/A","N/A","N/A","N/A","N/A","N/A","N/A","N/A","N/A","N/A","N/A","N/A"]
[null,null,null,null,null,null,null,null,null,null,null,null,null,null,null,null,null,null,null,null,null,null,null,null,null,null,null,null,null,null,null,null,null,null,null,null,null,null,null,null,null,null,null,null,null,null,null,null,null,null,null,null,null,"Mobile","N/A","N/A","N/A","N/A","N/A","N/A","N/A","N/A","N/A","N/A","N/A","N/A","N/A","N/A","N/A","N/A","N/A","N/A","N/A","N/A","N/A","N/A"]
[null,null,null,null,null,null,null,null,null,null,null,null,null,null,null,null,null,null,null,null,null,null,null,null,null,null,null,null,null,null,null,null,null,null,null,null,null,null,null,null,null,null,null,null,null,null,null,null,null,null,null,null,"Water / Soap","Water and soap","N/A","N/A","N/A","N/A","N/A","N/A","N/A","N/A","N/A","N/A","N/A","N/A","N/A","N/A","N/A","N/A","N/A","N/A","N/A","N/A","N/A","N/A"]
[null,null,null,null,null,null,null,null,null,null,null,null,null,null,null,null,null,null,null,null,null,null,null,null,null,null,null,null,null,null,null,null,null,null,null,null,null,null,null,null,null,null,null,null,null,null,null,null,null,null,null,null,null,"Water only","N/A","N/A","N/A","N/A","N/A","N/A","N/A","N/A","N/A","N/A","N/A","N/A","N/A","N/A","N/A","N/A","N/A","N/A","N/A","N/A","N/A","N/A"]
[null,null,null,null,null,null,null,null,null,null,null,null,null,null,null,null,null,null,null,null,null,null,null,null,null,null,null,null,null,null,null,null,null,null,null,null,null,null,null,null,null,null,null,null,null,null,null,null,null,null,null,null,null,"Soap only","N/A","N/A","N/A","N/A","N/A","N/A","N/A","N/A","N/A","N/A","N/A","N/A","N/A","N/A","N/A","N/A","N/A","N/A","N/A","N/A","N/A","N/A"]
[null,null,null,null,null,null,null,null,null,null,null,null,null,null,null,null,null,null,null,null,null,null,null,null,null,null,null,null,null,null,null,null,null,null,null,null,null,null,null,null,null,null,null,null,null,null,null,null,null,null,null,null,null,"Neither","N/A","N/A","N/A","N/A","N/A","N/A","N/A","N/A","N/A","N/A","N/A","N/A","N/A","N/A","N/A","N/A","N/A","N/A","N/A","N/A","N/A","N/A"]
[]
[]
[]
[]
[]
[]
[]
[]
[]
[]
[]
[]
[]
[]
[]
[]
[]
[]
[]
[]
[]
[]
[]
[]
[]
[]
[]
[]
[null,null,null,null,null,null,null,null,null,null,null,null,null,null,null,null,null,null,null,null,null,null,null,null,null,null,null,null,null,null,null,null,null,null,null,null,null,null,null,null,null,null,null,null,null,null,null,null,null,null,null,null,"Raw numbers of respondents:","Menstrual health and hygiene","NATIONAL wealth index quintile",null,null,null,null,"URBAN wealth index quintile",null,null,null,null,"RURAL wealth index quintile",null,null,null,null,"SUB-REGIONS:"]
[null,null,null,null,null,null,null,null,null,null,null,null,null,null,null,null,null,null,null,null,null,null,null,null,null,null,null,null,null,null,null,null,null,null,null,null,null,null,null,null,null,null,null,null,null,null,null,null,null,null,null,null,"MHH data, raw numbers (weighted)",null,"Poorest","Poor","Middle","Rich","Richest","Poorest","Poor","Middle","Rich","Richest","Poorest","Poor","Middle","Rich","Richest","Brest region","Gomel region","Grodno region","Minsk city","Minsk region","Mogilev region","Vitebsk region"]
[null,null,null,null,null,null,null,null,null,null,null,null,null,null,null,null,null,null,null,null,null,null,null,null,null,null,null,null,null,null,null,null,null,null,null,null,null,null,null,null,null,null,null,null,null,null,null,null,null,null,null,null,"Private place to wash and change","Yes","N/A","N/A","N/A","N/A","N/A","N/A","N/A","N/A","N/A","N/A","N/A","N/A","N/A","N/A","N/A","N/A","N/A","N/A","N/A","N/A","N/A","N/A"]
[null,null,null,null,null,null,null,null,null,null,null,null,null,null,null,null,null,null,null,null,null,null,null,null,null,null,null,null,null,null,null,null,null,null,null,null,null,null,null,null,null,null,null,null,null,null,null,null,null,null,null,null,null,"No","N/A","N/A","N/A","N/A","N/A","N/A","N/A","N/A","N/A","N/A","N/A","N/A","N/A","N/A","N/A","N/A","N/A","N/A","N/A","N/A","N/A","N/A"]
[null,null,null,null,null,null,null,null,null,null,null,null,null,null,null,null,null,null,null,null,null,null,null,null,null,null,null,null,null,null,null,null,null,null,null,null,null,null,null,null,null,null,null,null,null,null,null,null,null,null,null,null,null,"DK/not sure/missing","N/A","N/A","N/A","N/A","N/A","N/A","N/A","N/A","N/A","N/A","N/A","N/A","N/A","N/A","N/A","N/A","N/A","N/A","N/A","N/A","N/A","N/A"]
[null,null,null,null,null,null,null,null,null,null,null,null,null,null,null,null,null,null,null,null,null,null,null,null,null,null,null,null,null,null,null,null,null,null,null,null,null,null,null,null,null,null,null,null,null,null,null,null,null,null,null,null,"Use of menstrual materials","Materials reusable","N/A","N/A","N/A","N/A","N/A","N/A","N/A","N/A","N/A","N/A","N/A","N/A","N/A","N/A","N/A","N/A","N/A","N/A","N/A","N/A","N/A","N/A"]
[null,null,null,null,null,null,null,null,null,null,null,null,null,null,null,null,null,null,null,null,null,null,null,null,null,null,null,null,null,null,null,null,null,null,null,null,null,null,null,null,null,null,null,null,null,null,null,null,null,null,null,null,null,"Materials not reusable","N/A","N/A","N/A","N/A","N/A","N/A","N/A","N/A","N/A","N/A","N/A","N/A","N/A","N/A","N/A","N/A","N/A","N/A","N/A","N/A","N/A","N/A"]
[null,null,null,null,null,null,null,null,null,null,null,null,null,null,null,null,null,null,null,null,null,null,null,null,null,null,null,null,null,null,null,null,null,null,null,null,null,null,null,null,null,null,null,null,null,null,null,null,null,null,null,null,null,"No materials used","N/A","N/A","N/A","N/A","N/A","N/A","N/A","N/A","N/A","N/A","N/A","N/A","N/A","N/A","N/A","N/A","N/A","N/A","N/A","N/A","N/A","N/A"]
[null,null,null,null,null,null,null,null,null,null,null,null,null,null,null,null,null,null,null,null,null,null,null,null,null,null,null,null,null,null,null,null,null,null,null,null,null,null,null,null,null,null,null,null,null,null,null,null,null,null,null,null,null,"DK/not sure/missing","N/A","N/A","N/A","N/A","N/A","N/A","N/A","N/A","N/A","N/A","N/A","N/A","N/A","N/A","N/A","N/A","N/A","N/A","N/A","N/A","N/A","N/A"]
[null,null,null,null,null,null,null,null,null,null,null,null,null,null,null,null,null,null,null,null,null,null,null,null,null,null,null,null,null,null,null,null,null,null,null,null,null,null,null,null,null,null,null,null,null,null,null,null,null,null,null,null,"Use of menstrual materials with private place to wash and change","Materials reusable","N/A","N/A","N/A","N/A","N/A","N/A","N/A","N/A","N/A","N/A","N/A","N/A","N/A","N/A","N/A","N/A","N/A","N/A","N/A","N/A","N/A","N/A"]
[null,null,null,null,null,null,null,null,null,null,null,null,null,null,null,null,null,null,null,null,null,null,null,null,null,null,null,null,null,null,null,null,null,null,null,null,null,null,null,null,null,null,null,null,null,null,null,null,null,null,null,null,null,"Materials not reusable","N/A","N/A","N/A","N/A","N/A","N/A","N/A","N/A","N/A","N/A","N/A","N/A","N/A","N/A","N/A","N/A","N/A","N/A","N/A","N/A","N/A","N/A"]
[null,null,null,null,null,null,null,null,null,null,null,null,null,null,null,null,null,null,null,null,null,null,null,null,null,null,null,null,null,null,null,null,null,null,null,null,null,null,null,null,null,null,null,null,null,null,null,null,null,null,null,null,null,"No materials used","N/A","N/A","N/A","N/A","N/A","N/A","N/A","N/A","N/A","N/A","N/A","N/A","N/A","N/A","N/A","N/A","N/A","N/A","N/A","N/A","N/A","N/A"]
[null,null,null,null,null,null,null,null,null,null,null,null,null,null,null,null,null,null,null,null,null,null,null,null,null,null,null,null,null,null,null,null,null,null,null,null,null,null,null,null,null,null,null,null,null,null,null,null,null,null,null,null,"Awareness of menstruation before menarche","Yes","N/A","N/A","N/A","N/A","N/A","N/A","N/A","N/A","N/A","N/A","N/A","N/A","N/A","N/A","N/A","N/A","N/A","N/A","N/A","N/A","N/A","N/A"]
[null,null,null,null,null,null,null,null,null,null,null,null,null,null,null,null,null,null,null,null,null,null,null,null,null,null,null,null,null,null,null,null,null,null,null,null,null,null,null,null,null,null,null,null,null,null,null,null,null,null,null,null,null,"No","N/A","N/A","N/A","N/A","N/A","N/A","N/A","N/A","N/A","N/A","N/A","N/A","N/A","N/A","N/A","N/A","N/A","N/A","N/A","N/A","N/A","N/A"]
[null,null,null,null,null,null,null,null,null,null,null,null,null,null,null,null,null,null,null,null,null,null,null,null,null,null,null,null,null,null,null,null,null,null,null,null,null,null,null,null,null,null,null,null,null,null,null,null,null,null,null,null,null,"DK/not sure/missing","N/A","N/A","N/A","N/A","N/A","N/A","N/A","N/A","N/A","N/A","N/A","N/A","N/A","N/A","N/A","N/A","N/A","N/A","N/A","N/A","N/A","N/A"]
[null,null,null,null,null,null,null,null,null,null,null,null,null,null,null,null,null,null,null,null,null,null,null,null,null,null,null,null,null,null,null,null,null,null,null,null,null,null,null,null,null,null,null,null,null,null,null,null,null,null,null,null,"Participation in (all) activities during menstruation","Yes","N/A","N/A","N/A","N/A","N/A","N/A","N/A","N/A","N/A","N/A","N/A","N/A","N/A","N/A","N/A","N/A","N/A","N/A","N/A","N/A","N/A","N/A"]
[null,null,null,null,null,null,null,null,null,null,null,null,null,null,null,null,null,null,null,null,null,null,null,null,null,null,null,null,null,null,null,null,null,null,null,null,null,null,null,null,null,null,null,null,null,null,null,null,null,null,null,null,null,"No","N/A","N/A","N/A","N/A","N/A","N/A","N/A","N/A","N/A","N/A","N/A","N/A","N/A","N/A","N/A","N/A","N/A","N/A","N/A","N/A","N/A","N/A"]
[null,null,null,null,null,null,null,null,null,null,null,null,null,null,null,null,null,null,null,null,null,null,null,null,null,null,null,null,null,null,null,null,null,null,null,null,null,null,null,null,null,null,null,null,null,null,null,null,null,null,null,null,null,"DK/not sure/missing/no such activity","N/A","N/A","N/A","N/A","N/A","N/A","N/A","N/A","N/A","N/A","N/A","N/A","N/A","N/A","N/A","N/A","N/A","N/A","N/A","N/A","N/A","N/A"]
[null,null,null,null,null,null,null,null,null,null,null,null,null,null,null,null,null,null,null,null,null,null,null,null,null,null,null,null,null,null,null,null,null,null,null,null,null,null,null,null,null,null,null,null,null,null,null,null,null,null,null,null,"Participation in specific activities during menstruation","Did not go to school (amongst those usually attending school)","N/A","N/A","N/A","N/A","N/A","N/A","N/A","N/A","N/A","N/A","N/A","N/A","N/A","N/A","N/A","N/A","N/A","N/A","N/A","N/A","N/A","N/A"]
[null,null,null,null,null,null,null,null,null,null,null,null,null,null,null,null,null,null,null,null,null,null,null,null,null,null,null,null,null,null,null,null,null,null,null,null,null,null,null,null,null,null,null,null,null,null,null,null,null,null,null,null,null,"Did not go to work (amongst those who usually work)","N/A","N/A","N/A","N/A","N/A","N/A","N/A","N/A","N/A","N/A","N/A","N/A","N/A","N/A","N/A","N/A","N/A","N/A","N/A","N/A","N/A","N/A"]
[null,null,null,null,null,null,null,null,null,null,null,null,null,null,null,null,null,null,null,null,null,null,null,null,null,null,null,null,null,null,null,null,null,null,null,null,null,null,null,null,null,null,null,null,null,null,null,null,null,null,null,null,null,"Did not participate in social activities","N/A","N/A","N/A","N/A","N/A","N/A","N/A","N/A","N/A","N/A","N/A","N/A","N/A","N/A","N/A","N/A","N/A","N/A","N/A","N/A","N/A","N/A"]
[null,null,null,null,null,null,null,null,null,null,null,null,null,null,null,null,null,null,null,null,null,null,null,null,null,null,null,null,null,null,null,null,null,null,null,null,null,null,null,null,null,null,null,null,null,null,null,null,null,null,null,null,null,"Did not cook food","N/A","N/A","N/A","N/A","N/A","N/A","N/A","N/A","N/A","N/A","N/A","N/A","N/A","N/A","N/A","N/A","N/A","N/A","N/A","N/A","N/A","N/A"]
[null,null,null,null,null,null,null,null,null,null,null,null,null,null,null,null,null,null,null,null,null,null,null,null,null,null,null,null,null,null,null,null,null,null,null,null,null,null,null,null,null,null,null,null,null,null,null,null,null,null,null,null,null,"Did not eat with others","N/A","N/A","N/A","N/A","N/A","N/A","N/A","N/A","N/A","N/A","N/A","N/A","N/A","N/A","N/A","N/A","N/A","N/A","N/A","N/A","N/A","N/A"]
[null,null,null,null,null,null,null,null,null,null,null,null,null,null,null,null,null,null,null,null,null,null,null,null,null,null,null,null,null,null,null,null,null,null,null,null,null,null,null,null,null,null,null,null,null,null,null,null,null,null,null,null,null,"Did not bathe in regular place","N/A","N/A","N/A","N/A","N/A","N/A","N/A","N/A","N/A","N/A","N/A","N/A","N/A","N/A","N/A","N/A","N/A","N/A","N/A","N/A","N/A","N/A"]
[null,null,null,null,null,null,null,null,null,null,null,null,null,null,null,null,null,null,null,null,null,null,null,null,null,null,null,null,null,null,null,null,null,null,null,null,null,null,null,null,null,null,null,null,null,null,null,null,null,null,null,null,null,"Did not participate in other activities","N/A","N/A","N/A","N/A","N/A","N/A","N/A","N/A","N/A","N/A","N/A","N/A","N/A","N/A","N/A","N/A","N/A","N/A","N/A","N/A","N/A","N/A"]
[null,null,null,null,null,null,null,null,null,null,null,null,null,null,null,null,null,null,null,null,null,null,null,null,null,null,null,null,null,null,null,null,null,null,null,null,null,null,null,null,null,null,null,null,null,null,null,null,null,null,null,null,null,"DK/not sure/missing/no such activity","N/A","N/A","N/A","N/A","N/A","N/A","N/A","N/A","N/A","N/A","N/A","N/A","N/A","N/A","N/A","N/A","N/A","N/A","N/A","N/A","N/A","N/A"]
[]
[]
[]
[]
[]
[]
[]
[]
[]
[]
[]
[]
[]
[]
[]
[]
[]
[]
[]
[]
[]
[]
[]
[]
[]
[]
[]
[]
[]
[]
[]
[]
[]
[]
[]
[]
[]
[]
[]
[]
[]
[]
[]
[]
[]
[]
[]
[]
[]
[]
[]
[]
[]
[]
[null,null,null,null,null,null,null,null,null,null,null,null,null,null,null,null,null,null,null,null,null,null,null,null,null,null,null,null,null,null,null,null,null,null,null,null,null,null,null,null,null,null,null,null,null,null,null,null,null,null,null,null,"Raw numbers of respondents:","Basic water, sanitation and hygiene","NATIONAL wealth index quintile",null,null,null,null,"URBAN wealth index quintile",null,null,null,null,"RURAL wealth index quintile",null,null,null,null,"SUB-REGIONS:"]
[null,null,null,null,null,null,null,null,null,null,null,null,null,null,null,null,null,null,null,null,null,null,null,null,null,null,null,null,null,null,null,null,null,null,null,null,null,null,null,null,null,null,null,null,null,null,null,null,null,null,null,null,"WatSan data, raw numbers (weighted)",null,"Poorest","Poor","Middle","Rich","Richest","Poorest","Poor","Middle","Rich","Richest","Poorest","Poor","Middle","Rich","Richest","Brest region","Gomel region","Grodno region","Minsk city","Minsk region","Mogilev region","Vitebsk region"]
[null,null,null,null,null,null,null,null,null,null,null,null,null,null,null,null,null,null,null,null,null,null,null,null,null,null,null,null,null,null,null,null,null,null,null,null,null,null,null,null,null,null,null,null,null,null,null,null,null,null,null,null,"Use of Basic Water Sanitation and Hygiene","Yes","N/A","N/A","N/A","N/A","N/A","N/A","N/A","N/A","N/A","N/A","N/A","N/A","N/A","N/A","N/A","N/A","N/A","N/A","N/A","N/A","N/A","N/A"]
[null,null,null,null,null,null,null,null,null,null,null,null,null,null,null,null,null,null,null,null,null,null,null,null,null,null,null,null,null,null,null,null,null,null,null,null,null,null,null,null,null,null,null,null,null,null,null,null,null,null,null,null,null,"No","N/A","N/A","N/A","N/A","N/A","N/A","N/A","N/A","N/A","N/A","N/A","N/A","N/A","N/A","N/A","N/A","N/A","N/A","N/A","N/A","N/A","N/A"]
[null,null,null,null,null,null,null,null,null,null,null,null,null,null,null,null,null,null,null,null,null,null,null,null,null,null,null,null,null,null,null,null,null,null,null,null,null,null,null,null,null,null,null,null,null,null,null,null,null,null,null,null,"Use of Basic Water and Sanitation","Yes","N/A","N/A","N/A","N/A","N/A","N/A","N/A","N/A","N/A","N/A","N/A","N/A","N/A","N/A","N/A","N/A","N/A","N/A","N/A","N/A","N/A","N/A"]
[null,null,null,null,null,null,null,null,null,null,null,null,null,null,null,null,null,null,null,null,null,null,null,null,null,null,null,null,null,null,null,null,null,null,null,null,null,null,null,null,null,null,null,null,null,null,null,null,null,null,null,null,null,"No","N/A","N/A","N/A","N/A","N/A","N/A","N/A","N/A","N/A","N/A","N/A","N/A","N/A","N/A","N/A","N/A","N/A","N/A","N/A","N/A","N/A","N/A"]
[null,null,null,null,null,null,null,null,null,null,null,null,null,null,null,null,null,null,null,null,null,null,null,null,null,null,null,null,null,null,null,null,null,null,null,null,null,null,null,null,null,null,null,null,null,null,null,null,null,null,null,null,"Use of Basic Water and Hygiene","Yes","N/A","N/A","N/A","N/A","N/A","N/A","N/A","N/A","N/A","N/A","N/A","N/A","N/A","N/A","N/A","N/A","N/A","N/A","N/A","N/A","N/A","N/A"]
[null,null,null,null,null,null,null,null,null,null,null,null,null,null,null,null,null,null,null,null,null,null,null,null,null,null,null,null,null,null,null,null,null,null,null,null,null,null,null,null,null,null,null,null,null,null,null,null,null,null,null,null,null,"No","N/A","N/A","N/A","N/A","N/A","N/A","N/A","N/A","N/A","N/A","N/A","N/A","N/A","N/A","N/A","N/A","N/A","N/A","N/A","N/A","N/A","N/A"]
[null,null,null,null,null,null,null,null,null,null,null,null,null,null,null,null,null,null,null,null,null,null,null,null,null,null,null,null,null,null,null,null,null,null,null,null,null,null,null,null,null,null,null,null,null,null,null,null,null,null,null,null,"Use of Basic Sanitation and Hygiene","Yes","N/A","N/A","N/A","N/A","N/A","N/A","N/A","N/A","N/A","N/A","N/A","N/A","N/A","N/A","N/A","N/A","N/A","N/A","N/A","N/A","N/A","N/A"]
[null,null,null,null,null,null,null,null,null,null,null,null,null,null,null,null,null,null,null,null,null,null,null,null,null,null,null,null,null,null,null,null,null,null,null,null,null,null,null,null,null,null,null,null,null,null,null,null,null,null,null,null,null,"No","N/A","N/A","N/A","N/A","N/A","N/A","N/A","N/A","N/A","N/A","N/A","N/A","N/A","N/A","N/A","N/A","N/A","N/A","N/A","N/A","N/A","N/A"]
[null,null,null,null,null,null,null,null,null,null,null,null,null,null,null,null,null,null,null,null,null,null,null,null,null,null,null,null,null,null,null,null,null,null,null,null,null,null,null,null,null,null,null,null,null,null,null,null,null,null,null,null,"Use of Basic Water","Yes","N/A","N/A","N/A","N/A","N/A","N/A","N/A","N/A","N/A","N/A","N/A","N/A","N/A","N/A","N/A","N/A","N/A","N/A","N/A","N/A","N/A","N/A"]
[null,null,null,null,null,null,null,null,null,null,null,null,null,null,null,null,null,null,null,null,null,null,null,null,null,null,null,null,null,null,null,null,null,null,null,null,null,null,null,null,null,null,null,null,null,null,null,null,null,null,null,null,null,"No","N/A","N/A","N/A","N/A","N/A","N/A","N/A","N/A","N/A","N/A","N/A","N/A","N/A","N/A","N/A","N/A","N/A","N/A","N/A","N/A","N/A","N/A"]
[null,null,null,null,null,null,null,null,null,null,null,null,null,null,null,null,null,null,null,null,null,null,null,null,null,null,null,null,null,null,null,null,null,null,null,null,null,null,null,null,null,null,null,null,null,null,null,null,null,null,null,null,"Use of Basic Sanitation","Yes","N/A","N/A","N/A","N/A","N/A","N/A","N/A","N/A","N/A","N/A","N/A","N/A","N/A","N/A","N/A","N/A","N/A","N/A","N/A","N/A","N/A","N/A"]
[null,null,null,null,null,null,null,null,null,null,null,null,null,null,null,null,null,null,null,null,null,null,null,null,null,null,null,null,null,null,null,null,null,null,null,null,null,null,null,null,null,null,null,null,null,null,null,null,null,null,null,null,null,"No","N/A","N/A","N/A","N/A","N/A","N/A","N/A","N/A","N/A","N/A","N/A","N/A","N/A","N/A","N/A","N/A","N/A","N/A","N/A","N/A","N/A","N/A"]
[null,null,null,null,null,null,null,null,null,null,null,null,null,null,null,null,null,null,null,null,null,null,null,null,null,null,null,null,null,null,null,null,null,null,null,null,null,null,null,null,null,null,null,null,null,null,null,null,null,null,null,null,"Access to Basic Hygiene","Yes","N/A","N/A","N/A","N/A","N/A","N/A","N/A","N/A","N/A","N/A","N/A","N/A","N/A","N/A","N/A","N/A","N/A","N/A","N/A","N/A","N/A","N/A"]
[null,null,null,null,null,null,null,null,null,null,null,null,null,null,null,null,null,null,null,null,null,null,null,null,null,null,null,null,null,null,null,null,null,null,null,null,null,null,null,null,null,null,null,null,null,null,null,null,null,null,null,null,null,"No","N/A","N/A","N/A","N/A","N/A","N/A","N/A","N/A","N/A","N/A","N/A","N/A","N/A","N/A","N/A","N/A","N/A","N/A","N/A","N/A","N/A","N/A"]
[]
[]
[]
[]
[]
[]
[]
[]
[]
[]
[]
[]
[]
[]
[]
[]
[]
[]
[]
[]
[]
[]
[]
[]
[]
[]
[]
[]
[]
[]
[]
[]
[]
[]
[]
[]
[]
[]
[]
[]
[]
[]
[]
[]
[null,null,"INITIAL (national) Wealth Index",null,null,null,null,"URBAN Wealth Index",null,null,null,null,"RURAL Wealth Index"]
[null,null,"Component Matrix",null,null,null,null,"Component Matrix",null,null,null,null,"Component Matrix"]
[null,null,null,null,"Component",null,null,null,null,"Component",null,null,null,null,"Component"]
[null,"Note:\n\nThe INITIAL (national) Wealth Index is based on the first component of the Principal Component Analysis (PCA) which has been obtained at national level.\n\nThe final national-level (NATIONAL) Wealth Index is based on the URBAN and RURAL specific wealth indexes. Regression procedures are used to establish the relationships between the two sets of scores (urban and rural) and the initial (national) wealth factors.\nThis allows best use of the available information for each area and a better precision of the FINAL (NATIONAL) Wealth Index.\n\nFor dependency reasons, all WASH variables (contained in the generic MICS and DHS scripts) have been excluded from the sets of asset variables used in the PCAs.\n\nThe PCA can extracts as many components as there are asset variables in the input. Only the first of the components is used to represent the Wealth Index. \n\nThe scores represent the weights of the asset variables on the Wealth Index (correlations between the variables and the component).\n\nThe communalities are the proportion of each variable's variance that can be explained by the component.\n\nProportion of explained variance is the part of the model's total variance that is explained by the component.\n\nFor more information on the procedure used:\n\nThe DHS Wealth Index, DHS Comparative Reports No. 6, Shea Oscar Rutstein, Kiersten Johnson, ORC Macro International Inc., 2004.\n\nThe DHS Wealth Index: Approaches for Rural and Urban Areas, Shea O. Rutstein, ORC Macro International Inc., 2008.\n\nMICS Methodological Paper No. 4, Review of options for reporting water, sanitation and hygiene coverage by wealth quintile, UNICEF, 2016.",null,null,"1",null,null,null,null,"1",null,null,null,null,"1"]
[null,null,"Has slate roof",null,-0.70877705216379538,null,null,"Has slate roof",null,-0.74496826599192512,null,null,"Household has: vacuum cleaner",null,0.67117882301691623]
[null,null,"Has ruberoid roof",null,0.69061209498078102,null,null,"Has ruberoid roof",null,0.72839359875323306,null,null,"Household has: personal computer",null,0.62608227766765301]
[null,null,"Household fuel type: LPG",null,-0.6624617854006849,null,null,"Has wood floor",null,-0.60314030680945252,null,null,"Household has: microwave",null,0.62590225963684554]
[null,null,"Has wood floor",null,-0.63232334682722258,null,null,"Has wood wall",null,-0.55279623576008508,null,null,"Has wood wall",null,-0.61906728534084665]
[null,null,"Has wood wall",null,-0.61580984329540078,null,null,"Has concrete or ferro-concrete wall",null,0.54243974466345801,null,null,"Household member owns: mobile phone",null,0.6133936664144789]
[null,null,"Household has: microwave",null,0.56120712905946346,null,null,"Household fuel type: LPG",null,-0.53312599589678455,null,null,"Household has: dvd",null,0.6001661004382719]
[null,null,"Household has: personal computer",null,0.56097112918074399,null,null,"Household has: personal computer",null,0.45751625233165177,null,null,"Household has: laundry washer",null,0.57966427635862383]
[null,null,"Household has: vacuum cleaner",null,0.55427590939743265,null,null,"Household owns chickens",null,-0.44091020471398573,null,null,"Household member owns: car/truck",null,0.55283551259836494]
[null,null,"Has concrete or ferro-concrete wall",null,0.50949973770492452,null,null,"Household has: microwave",null,0.44090857422387569,null,null,"Household fuel type: natural gas",null,0.49040828988277929]
[null,null,"Household member owns: mobile phone",null,0.49669245511698712,null,null,"Household member owns: mobile phone",null,0.39088281052191809,null,null,"Household has: deep-freezer",null,0.45597301387703781]
[null,null,"Household fuel type: natural gas",null,0.49161508501777496,null,null,"Household has: laundry washer",null,0.3759080730665777,null,null,"Has wood floor",null,-0.45456274151390175]
[null,null,"Household has: laundry washer",null,0.47988454162513994,null,null,"Household owns agricultural land",null,-0.35897695451412892,null,null,"Household fuel type: LPG",null,-0.43463447724303023]
[null,null,"Household member owns: car/truck",null,0.41947076108670589,null,null,"Household has: dvd",null,0.33451432678163423,null,null,"Has slate roof",null,-0.40332697671771078]
[null,null,"Household has: dvd",null,0.40777538319892431,null,null,"Has laminat floor",null,0.33311949373734989,null,null,"Has ruberoid roof",null,0.34873644817667399]
[null,null,"Has laminat floor",null,0.37383339335506988,null,null,"Household has: vacuum cleaner",null,0.32441054715780304,null,null,"Household has: non-mobile telephone",null,0.33865187252416074]
[null,null,"Household has: non-mobile telephone",null,0.34565492533509795,null,null,"Household member owns: car/truck",null,0.31919654042039303,null,null,"Has laminat floor",null,0.30331979044581325]
[null,null,"Has linoleum floor",null,0.29169235235650481,null,null,"Has linoleum floor",null,0.27332943473731947,null,null,"Persons per sleeping rooms",null,0.30331966860605708]
[null,null,"Persons per sleeping rooms",null,0.26290179717381068,null,null,"Persons per sleeping rooms",null,0.25675748150157668,null,null,"Household has: refrigerator",null,0.29824557571300075]
[null,null,"Household has: refrigerator",null,0.22744667148656428,null,null,"Household owns pigs",null,-0.25561011135178069,null,null,"Has brick wall",null,0.29821870725753907]
[null,null,"Household fuel type: electricity",null,0.20757713001139622,null,null,"Household fuel type: electricity",null,0.24373348733652681,null,null,"Has linoleum floor",null,0.24525180764962731]
[null,null,"Household owns bank account",null,0.20608936509462197,null,null,"Has brick wall",null,-0.21694176907323365,null,null,"Has concrete or ferro-concrete wall",null,0.23408914732082101]
[null,null,"Has parquet/polished wood floor",null,0.18005502449683286,null,null,"Household fuel type: natural gas",null,0.16674224582429525,null,null,"Household has: television",null,0.21688642861033652]
[null,null,"Household has: television",null,0.16991891449242691,null,null,"Household has: non-mobile telephone",null,0.15693274994855186,null,null,"Has covered block wall",null,0.19869492663770871]
[null,null,"Household member owns: animal drawn cart",null,-0.16817698220741512,null,null,"Household owns rabbits",null,-0.15252812131477259,null,null,"Household owns dwelling",null,-0.19489920150409304]
[null,null,"Household fuel type: wood",null,-0.16128650890081936,null,null,"Household owns cattle milk cows or bulls",null,-0.14808316837134239,null,null,"Household fuel type: wood",null,-0.17233466331048941]
[null,null,"Household has: dishwasher",null,0.15215506649432167,null,null,"Household owns goats",null,-0.14527668222072465,null,null,"Household has: dishwasher",null,0.17177363143050137]
[null,null,"Household has: deep-freezer",null,0.13672308387635362,null,null,"Has parquet/polished wood floor",null,0.1412492868014705,null,null,"Household member owns: motorcycle/scooter",null,0.16563725058995021]
[null,null,"Has other floor",null,9.2570552685748514E-2,null,null,"Household owns horses donkeys mules",null,-0.13619418263963429,null,null,"Household owns agricultural land",null,-0.16433354890391985]
[null,null,"Household member owns: motorcycle/scooter",null,-6.4590269501968084E-2,null,null,"Household owns bank account",null,0.12274073671938122,null,null,"Household owns pigs",null,0.16387741537196721]
[null,null,"Has brick wall",null,-5.6854933829899514E-2,null,null,"Household has: dishwasher",null,0.1206735516214595,null,null,"Has other floor",null,0.16261354363155323]
[null,null,"Household member owns: minibus",null,5.671126581673315E-2,null,null,"Household has: refrigerator",null,0.11826561182151098,null,null,"Has ceramic tile roof",null,0.15817470428780989]
[null,null,"Has covered block wall",null,5.3099953545227167E-2,null,null,"Household has: television",null,0.11239040621040643,null,null,"Household owns bank account",null,0.14923252417833163]
[null,null,"Has wood roof",null,-5.1165001505805607E-2,null,null,"Household fuel type: wood",null,-0.10386584653135607,null,null,"Household member owns: minibus",null,0.11469443257255103]
[null,null,"Has ceramic tile floor",null,4.5571154064624399E-2,null,null,"Household owns dwelling",null,-9.0562330758732448E-2,null,null,"Has cement block wall",null,0.10790980537316223]
[null,null,"Household member owns: boat with motor",null,4.2600623322779169E-2,null,null,"Household owns sheep",null,-8.37787788482596E-2,null,null,"Has parquet/polished wood floor",null,0.10463522921825841]
[null,null,"Has plastic wall",null,-3.9301884358228227E-2,null,null,"Household has: deep-freezer",null,7.7159606939606856E-2,null,null,"Has wood roof",null,-9.527609970072215E-2]
[null,null,"Has carpet floor",null,3.4392855625268989E-2,null,null,"Has plastic wall",null,-7.3579544528665691E-2,null,null,"Household owns horses donkeys mules",null,-8.872497515635891E-2]
[null,null,"Has cement block wall",null,3.1745456241499943E-2,null,null,"Household member owns: animal drawn cart",null,-7.2560076344720711E-2,null,null,"Has metal roof",null,8.8191369230852787E-2]
[null,null,"Has ceramic tile roof",null,2.7178758064209687E-2,null,null,"Household member owns: motorcycle/scooter",null,-6.1990599612801921E-2,null,null,"Household member owns: animal drawn cart",null,-7.9592265419814387E-2]
[null,null,"Has metal roof",null,3.4116894440314981E-3,null,null,"Has metal roof",null,-5.4732636568084699E-2,null,null,"Household owns rabbits",null,7.6504869207626225E-2]
[null,null,null,null,null,null,null,"Has other floor",null,4.4797016420759977E-2,null,null,"Household owns rent dwelling",null,6.6326724314752603E-2]
[null,null,null,null,null,null,null,"Household owns rent dwelling",null,4.3407831201110393E-2,null,null,"Has ceramic tile floor",null,5.874397936942273E-2]
[null,null,null,null,null,null,null,"Has ceramic tile floor",null,4.2219976219142294E-2,null,null,"Has plastic wall",null,5.7182241800655134E-2]
[null,null,"Communalities",null,null,null,null,"Household member owns: boat with motor",null,2.4835089787353787E-2,null,null,"Household owns goats",null,-4.4349729521028856E-2]
[null,null,null,null,"Extraction",null,null,"Has carpet floor",null,2.2477244413487484E-2,null,null,"Household member owns: boat with motor",null,4.4010057252247173E-2]
[null,null,"Persons per sleeping rooms",null,6.911735495721949E-2,null,null,"Household member owns: minibus",null,2.2208069179914715E-2,null,null,"Household owns chickens",null,-4.3541661033799813E-2]
[null,null,"Has wood floor",null,0.39983281494278,null,null,"Has cement block wall",null,1.9019707978210006E-2,null,null,"Has carpet floor",null,4.2447551304571604E-2]
[null,null,"Has parquet/polished wood floor",null,3.2419811846555083E-2,null,null,"Has covered block wall",null,-1.208516379731361E-2,null,null,"Household owns cattle milk cows or bulls",null,3.1447547149313408E-2]
[null,null,"Has linoleum floor",null,8.5084428423271366E-2,null,null,"Has wood roof",null,-2.7678592287836293E-3,null,null,"Household owns sheep",null,2.0967839332117783E-2]
[null,null,"Has ceramic tile floor",null,2.076730082781733E-3,null,null,"Has ceramic tile roof",null,1.859304980237684E-3,null,null,"Household fuel type: electricity",null,2.0351477290325303E-3]
[null,null,"Has carpet floor",null,1.1828685180605967E-3]
[null,null,"Has laminat floor",null,0.13975140598736641]
[null,null,"Has other floor",null,8.5693072245449416E-3]
[null,null,"Has metal roof",null,1.1639624862515952E-5,null,null,"Communalities",null,null,null,null,"Communalities"]
[null,null,"Has wood roof",null,2.6178573790890899E-3,null,null,null,null,"Extraction",null,null,null,null,"Extraction"]
[null,null,"Has ceramic tile roof",null,7.3868488991284305E-4,null,null,"Persons per sleeping rooms",null,6.5924404307032489E-2,null,null,"Persons per sleeping rooms",null,9.2002821363288287E-2]
[null,null,"Has slate roof",null,0.50236490967399949,null,null,"Has wood floor",null,0.36377822969820051,null,null,"Has wood floor",null,0.20662728597263424]
[null,null,"Has ruberoid roof",null,0.47694506573374329,null,null,"Has parquet/polished wood floor",null,1.9951361021924068E-2,null,null,"Has parquet/polished wood floor",null,1.0948531193557478E-2]
[null,null,"Has brick wall",null,3.2324835008022521E-3,null,null,"Has linoleum floor",null,7.470897989382258E-2,null,null,"Has linoleum floor",null,6.0148449155409796E-2]
[null,null,"Has cement block wall",null,1.0077739919809878E-3,null,null,"Has ceramic tile floor",null,1.7825263919449409E-3,null,null,"Has ceramic tile floor",null,3.4508551121551633E-3]
[null,null,"Has covered block wall",null,2.8196050665052833E-3,null,null,"Has carpet floor",null,5.0522651642365428E-4,null,null,"Has carpet floor",null,1.8017946117542384E-3]
[null,null,"Has wood wall",null,0.37922176309950606,null,null,"Has laminat floor",null,0.11096859710782829,null,null,"Has laminat floor",null,9.2002895276092067E-2]
[null,null,"Has plastic wall",null,1.5446381141075447E-3,null,null,"Has other floor",null,2.0067726802018388E-3,null,null,"Has other floor",null,2.6443164572411065E-2]
[null,null,"Has concrete or ferro-concrete wall",null,0.25958998272138689,null,null,"Has metal roof",null,2.9956615056940424E-3,null,null,"Has metal roof",null,7.7777176068126079E-3]
[null,null,"Household fuel type: electricity",null,4.3088264903768089E-2,null,null,"Has wood roof",null,7.6610447103627077E-6,null,null,"Has wood roof",null,9.0775351741819478E-3]
[null,null,"Household fuel type: LPG",null,0.43885561711626309,null,null,"Has ceramic tile roof",null,3.4570150095366545E-6,null,null,"Has ceramic tile roof",null,2.5019237076536104E-2]
[null,null,"Household fuel type: natural gas",null,0.24168539181703411,null,null,"Has slate roof",null,0.55497771733501566,null,null,"Has slate roof",null,0.1626726501482488]
[null,null,"Household fuel type: wood",null,2.6013337953414081E-2,null,null,"Has ruberoid roof",null,0.53055723470468585,null,null,"Has ruberoid roof",null,0.12161711028688202]
[null,null,"Household has: television",null,2.8872437502284687E-2,null,null,"Has brick wall",null,4.7063731168624237E-2,null,null,"Has brick wall",null,8.8934397358357786E-2]
[null,null,"Household has: dvd",null,0.16628076314302956,null,null,"Has cement block wall",null,3.6174929157638535E-4,null,null,"Has cement block wall",null,1.1644526095673752E-2]
[null,null,"Household has: non-mobile telephone",null,0.11947732740841215,null,null,"Has covered block wall",null,1.4605118400789954E-4,null,null,"Has covered block wall",null,3.9479673871564445E-2]
[null,null,"Household has: refrigerator",null,5.1731988370317089E-2,null,null,"Has wood wall",null,0.30558367827051958,null,null,"Has wood wall",null,0.38324430377928526]
[null,null,"Household has: deep-freezer",null,1.8693201664660427E-2,null,null,"Has plastic wall",null,5.4139493730458975E-3,null,null,"Has plastic wall",null,3.2698087773485912E-3]
[null,null,"Household has: vacuum cleaner",null,0.30722178373835096,null,null,"Has concrete or ferro-concrete wall",null,0.29424087659055753,null,null,"Has concrete or ferro-concrete wall",null,5.479772889338904E-2]
[null,null,"Household has: microwave",null,0.31495344170716527,null,null,"Household fuel type: electricity",null,5.9406012849224872E-2,null,null,"Household fuel type: electricity",null,4.1418262789862654E-6]
[null,null,"Household has: personal computer",null,0.31468860777431895,null,null,"Household fuel type: LPG",null,0.28422332750093832,null,null,"Household fuel type: LPG",null,0.18890712880832217]
[null,null,"Household has: laundry washer",null,0.23028917329077067,null,null,"Household fuel type: natural gas",null,2.7802976542529709E-2,null,null,"Household fuel type: natural gas",null,0.24050029078575208]
[null,null,"Household has: dishwasher",null,2.315116425989145E-2,null,null,"Household fuel type: wood",null,1.0788114075675211E-2,null,null,"Household fuel type: wood",null,2.9699236178339746E-2]
[null,null,"Household member owns: mobile phone",null,0.24670339497014027,null,null,"Household has: television",null,1.2631603408140164E-2,null,null,"Household has: television",null,4.7039722915346603E-2]
[null,null,"Household member owns: motorcycle/scooter",null,4.1719029143368683E-3,null,null,"Household has: dvd",null,0.11189983482216997,null,null,"Household has: dvd",null,0.36019934811528187]
[null,null,"Household member owns: animal drawn cart",null,2.828349734439322E-2,null,null,"Household has: non-mobile telephone",null,2.4627888006414703E-2,null,null,"Household has: non-mobile telephone",null,0.11468509076412041]
[null,null,"Household member owns: car/truck",null,0.1759557194066603,null,null,"Household has: refrigerator",null,1.3986754939516318E-2,null,null,"Household has: refrigerator",null,8.8950423432379272E-2]
[null,null,"Household member owns: minibus",null,3.2161676705361659E-3,null,null,"Household has: deep-freezer",null,5.9536049430746266E-3,null,null,"Household has: deep-freezer",null,0.20791138938410933]
[null,null,"Household member owns: boat with motor",null,1.8148131074893165E-3,null,null,"Household has: vacuum cleaner",null,0.10524220310722515,null,null,"Household has: vacuum cleaner",null,0.45048101246637295]
[null,null,"Household owns bank account",null,4.2472826405104393E-2,null,null,"Household has: microwave",null,0.19440037082413089,null,null,"Household has: microwave",null,0.3917536386185092]
[null,null,null,null,null,null,null,"Household has: personal computer",null,0.20932112114759965,null,null,"Household has: personal computer",null,0.39197901840951616]
[null,null,null,null,null,null,null,"Household has: laundry washer",null,0.1413068793966275,null,null,"Household has: laundry washer",null,0.33601067328636702]
[null,null,"Total Variance Explained",null,null,null,null,"Household has: dishwasher",null,1.4562106060937051E-2,null,null,"Household has: dishwasher",null,2.9506180454821725E-2]
[null,null,"Component",null,"Extraction Sums of Squared Loadings",null,null,"Household member owns: mobile phone",null,0.15278937156151373,null,null,"Household member owns: mobile phone",null,0.376251789997397]
[null,null,null,null,"Total","% of Variance","Cumulative %","Household member owns: motorcycle/scooter",null,3.8428344403547178E-3,null,null,"Household member owns: motorcycle/scooter",null,2.7435698782997963E-2]
[null,null,"1",null,5.1957499482468172,12.989374870617043,12.989374870617043,"Household member owns: animal drawn cart",null,5.264964679151698E-3,null,null,"Household member owns: animal drawn cart",null,6.3349287146581808E-3]
[null,null,null,null,null,null,null,"Household member owns: car/truck",null,0.10188643141634759,null,null,"Household member owns: car/truck",null,0.3056271039898969]
[null,null,null,null,null,null,null,"Household member owns: minibus",null,4.9319833669987786E-4,null,null,"Household member owns: minibus",null,1.3154812863139456E-2]
[null,null,"Component Score Coefficient Matrix",null,null,null,null,"Household member owns: boat with motor",null,6.1678168474592441E-4,null,null,"Household member owns: boat with motor",null,1.9368851393460739E-3]
[null,null,null,null,"Component",null,null,"Household owns dwelling",null,8.2015357524540568E-3,null,null,"Household owns dwelling",null,3.7985698746933062E-2]
[null,null,null,null,"1",null,null,"Household owns rent dwelling",null,1.8842398095840929E-3,null,null,"Household owns rent dwelling",null,4.3992343583251943E-3]
[null,null,"Persons per sleeping rooms",null,5.059939369532606E-2,null,null,"Household owns agricultural land",null,0.12886445387223899,null,null,"Household owns agricultural land",null,2.7005515295357017E-2]
[null,null,"Has wood floor",null,-0.12170011126893918,null,null,"Household owns cattle milk cows or bulls",null,2.1928624754895338E-2,null,null,"Household owns cattle milk cows or bulls",null,9.8894822170828988E-4]
[null,null,"Has parquet/polished wood floor",null,3.4654289811923721E-2,null,null,"Household owns horses donkeys mules",null,1.8548855384878063E-2,null,null,"Household owns horses donkeys mules",null,7.8721212164965058E-3]
[null,null,"Has linoleum floor",null,5.6140567822154243E-2,null,null,"Household owns goats",null,2.1105314397061415E-2,null,null,"Household owns goats",null,1.9668985085884183E-3]
[null,null,"Has ceramic tile floor",null,8.7708520461038178E-3,null,null,"Household owns sheep",null,7.0188837853055897E-3,null,null,"Household owns sheep",null,4.3965028625750553E-4]
[null,null,"Has carpet floor",null,6.6194208666400592E-3,null,null,"Household owns chickens",null,0.19440180862092882,null,null,"Household owns chickens",null,1.8958762455823209E-3]
[null,null,"Has laminat floor",null,7.1949843059943855E-2,null,null,"Household owns pigs",null,6.5336529025269721E-2,null,null,"Household owns pigs",null,2.6855807268996272E-2]
[null,null,"Has other floor",null,1.7816591176983847E-2,null,null,"Household owns rabbits",null,2.3264827791813984E-2,null,null,"Household owns rabbits",null,5.8529950124759957E-3]
[null,null,"Has metal roof",null,6.5663079979102763E-4,null,null,"Household owns bank account",null,1.5065288450416459E-2,null,null,"Household owns bank account",null,2.2270346272636337E-2]
[null,null,"Has wood roof",null,-9.8474718790248997E-3]
[null,null,"Has ceramic tile roof",null,5.2309595986967227E-3]
[null,null,"Has slate roof",null,-0.13641477346363742,null,null,"Total Variance Explained",null,null,null,null,"Total Variance Explained"]
[null,null,"Has ruberoid roof",null,0.13291865502761765,null,null,"Component",null,"Extraction Sums of Squared Loadings",null,null,"Component",null,"Extraction Sums of Squared Loadings"]
[null,null,"Has brick wall",null,-1.0942584688680769E-2,null,null,null,null,"Total","% of Variance","Cumulative %",null,null,"Total","% of Variance","Cumulative %"]
[null,null,"Has cement block wall",null,6.1098891512690479E-3,null,null,"1",null,4.3676446064886898,8.7352892129773796,8.7352892129773796,"1",null,5.1468620926918929,10.293724185383786,10.293724185383786]
[null,null,"Has covered block wall",null,1.021988241815688E-2]
[null,null,"Has wood wall",null,-0.1185218398555133]
[null,null,"Has plastic wall",null,-7.5642370687006829E-3,null,null,"Component Score Coefficient Matrix",null,null,null,null,"Component Score Coefficient Matrix"]
[null,null,"Has concrete or ferro-concrete wall",null,9.8060865665185279E-2,null,null,null,null,"Component",null,null,null,null,"Component"]
[null,null,"Household fuel type: electricity",null,3.9951331776741532E-2,null,null,null,null,"1",null,null,null,null,"1"]
[null,null,"Household fuel type: LPG",null,-0.12750070576899433,null,null,"Persons per sleeping rooms",null,5.8786257728051135E-2,null,null,"Persons per sleeping rooms",null,5.8932931006009527E-2]
[null,null,"Household fuel type: natural gas",null,9.4618696033218236E-2,null,null,"Has wood floor",null,-0.13809280771457708,null,null,"Has wood floor",null,-8.8318422628681337E-2]
[null,null,"Household fuel type: wood",null,-3.104200750754791E-2,null,null,"Has parquet/polished wood floor",null,3.2339922206954919E-2,null,null,"Has parquet/polished wood floor",null,2.0329907297658427E-2]
[null,null,"Household has: television",null,3.270344342682658E-2,null,null,"Has linoleum floor",null,6.2580511777733439E-2,null,null,"Has linoleum floor",null,4.7650743935390087E-2]
[null,null,"Household has: dvd",null,7.8482488045160545E-2,null,null,"Has ceramic tile floor",null,9.6665319692951102E-3,null,null,"Has ceramic tile floor",null,1.1413552240467877E-2]
[null,null,"Household has: non-mobile telephone",null,6.6526474287264548E-2,null,null,"Has carpet floor",null,5.1463080077748724E-3,null,null,"Has carpet floor",null,8.2472680518958404E-3]
[null,null,"Household has: refrigerator",null,4.3775523024026743E-2,null,null,"Has laminat floor",null,7.6269825901690472E-2,null,null,"Has laminat floor",null,5.8932954678638398E-2]
[null,null,"Household has: deep-freezer",null,2.6314407975404512E-2,null,null,"Has other floor",null,1.025656170701442E-2,null,null,"Has other floor",null,3.1594696089186199E-2]
[null,null,"Household has: vacuum cleaner",null,0.1066787114311496,null,null,"Has metal roof",null,-1.2531385105549204E-2,null,null,"Has metal roof",null,1.7134978097835003E-2]
[null,null,"Household has: microwave",null,0.10801272860500716,null,null,"Has wood roof",null,-6.3371896712283377E-4,null,null,"Has wood roof",null,-1.8511492630821823E-2]
[null,null,"Household has: personal computer",null,0.10796730688897575,null,null,"Has ceramic tile roof",null,4.2569969577548733E-4,null,null,"Has ceramic tile roof",null,3.0732260052664821E-2]
[null,null,"Household has: laundry washer",null,9.2360977030287159E-2,null,null,"Has slate roof",null,-0.17056522064207791,null,null,"Has slate roof",null,-7.8363664977618291E-2]
[null,null,"Household has: dishwasher",null,2.9284524469015836E-2,null,null,"Has ruberoid roof",null,0.16677034520416606,null,null,"Has ruberoid roof",null,6.7757099742744256E-2]
[null,null,"Household member owns: mobile phone",null,9.5595912055887952E-2,null,null,"Has brick wall",null,-4.9670197238790695E-2,null,null,"Has brick wall",null,5.7941849205748949E-2]
[null,null,"Household member owns: motorcycle/scooter",null,-1.2431366048276158E-2,null,null,"Has cement block wall",null,4.3546830595955115E-3,null,null,"Has cement block wall",null,2.0966134982785923E-2]
[null,null,"Household member owns: animal drawn cart",null,-3.2368182434214805E-2,null,null,"Has covered block wall",null,-2.7669750829450645E-3,null,null,"Has covered block wall",null,3.8605061309071924E-2]
[null,null,"Household member owns: car/truck",null,8.0733438919293327E-2,null,null,"Has wood wall",null,-0.12656621258488751,null,null,"Has wood wall",null,-0.12028052708462303]
[null,null,"Household member owns: minibus",null,1.0914933624907993E-2,null,null,"Has plastic wall",null,-1.6846504502530706E-2,null,null,"Has plastic wall",null,1.1110117343507041E-2]
[null,null,"Household member owns: boat with motor",null,8.199128854758252E-3,null,null,"Has concrete or ferro-concrete wall",null,0.12419502810681868,null,null,"Has concrete or ferro-concrete wall",null,4.5481915603141528E-2]
[null,null,"Household owns bank account",null,3.9664989105983046E-2,null,null,"Household fuel type: electricity",null,5.5804331463789367E-2,null,null,"Household fuel type: electricity",null,3.9541524377003761E-4]
[null,null,null,null,null,null,null,"Household fuel type: LPG",null,-0.12206258611443754,null,null,"Household fuel type: LPG",null,-8.4446497577655003E-2]
[null,null,null,null,null,null,null,"Household fuel type: natural gas",null,3.8176697246973451E-2,null,null,"Household fuel type: natural gas",null,9.5282966796238336E-2]
[null,null,"Component Score Covariance Matrix",null,null,null,null,"Household fuel type: wood",null,-2.3780745891515569E-2,null,null,"Household fuel type: wood",null,-3.3483442961331725E-2]
[null,null,"Component",null,"1",null,null,"Household has: television",null,2.5732498025007849E-2,null,null,"Household has: television",null,4.2139545358772457E-2]
[null,null,"1",null,1,null,null,"Household has: dvd",null,7.6589181794844446E-2,null,null,"Household has: dvd",null,0.1166081565096638]
[null,null,null,null,null,null,null,"Household has: non-mobile telephone",null,3.5930750802253532E-2,null,null,"Household has: non-mobile telephone",null,6.5797735868038457E-2]
[null,null,null,null,null,null,null,"Household has: refrigerator",null,2.7077663701348863E-2,null,null,"Household has: refrigerator",null,5.7947069562342503E-2]
[null,null,null,null,null,null,null,"Household has: deep-freezer",null,1.7666182551798387E-2,null,null,"Household has: deep-freezer",null,8.8592428875154991E-2]
[null,null,null,null,null,null,null,"Household has: vacuum cleaner",null,7.4275857215087948E-2,null,null,"Household has: vacuum cleaner",null,0.13040544139893184]
[null,null,null,null,null,null,null,"Household has: microwave",null,0.10094882114924139,null,null,"Household has: microwave",null,0.1216085157062152]
[null,null,null,null,null,null,null,"Household has: personal computer",null,0.10475125463549695,null,null,"Household has: personal computer",null,0.12164349197477757]
[null,null,null,null,null,null,null,"Household has: laundry washer",null,8.6066543167939644E-2,null,null,"Household has: laundry washer",null,0.11262479272209333]
[null,null,null,null,null,null,null,"Household has: dishwasher",null,2.7628976827048519E-2,null,null,"Household has: dishwasher",null,3.3374438315416567E-2]
[null,null,null,null,null,null,null,"Household member owns: mobile phone",null,8.9495104510383464E-2,null,null,"Household member owns: mobile phone",null,0.11917818184509858]
[null,null,null,null,null,null,null,"Household member owns: motorcycle/scooter",null,-1.4193141887210102E-2,null,null,"Household member owns: motorcycle/scooter",null,3.2182181610255517E-2]
[null,null,null,null,null,null,null,"Household member owns: animal drawn cart",null,-1.6613090780537295E-2,null,null,"Household member owns: animal drawn cart",null,-1.5464231212417497E-2]
[null,null,null,null,null,null,null,"Household member owns: car/truck",null,7.3082077224457781E-2,null,null,"Household member owns: car/truck",null,0.10741214795386582]
[null,null,null,null,null,null,null,"Household member owns: minibus",null,5.0846786267641384E-3,null,null,"Household member owns: minibus",null,2.2284341508859818E-2]
[null,null,null,null,null,null,null,"Household member owns: boat with motor",null,5.686151696147188E-3,null,null,"Household member owns: boat with motor",null,8.5508522396078434E-3]
[null,null,null,null,null,null,null,"Household owns dwelling",null,-2.0734821378138368E-2,null,null,"Household owns dwelling",null,-3.7867577952172722E-2]
[null,null,null,null,null,null,null,"Household owns rent dwelling",null,9.9384989192166737E-3,null,null,"Household owns rent dwelling",null,1.288682756993449E-2]
[null,null,null,null,null,null,null,"Household owns agricultural land",null,-8.2190055935600401E-2,null,null,"Household owns agricultural land",null,-3.192888131532795E-2]
[null,null,null,null,null,null,null,"Household owns cattle milk cows or bulls",null,-3.3904582838847744E-2,null,null,"Household owns cattle milk cows or bulls",null,6.1100426984368322E-3]
[null,null,null,null,null,null,null,"Household owns horses donkeys mules",null,-3.1182523971227082E-2,null,null,"Household owns horses donkeys mules",null,-1.7238654068921111E-2]
[null,null,null,null,null,null,null,"Household owns goats",null,-3.3262019992399951E-2,null,null,"Household owns goats",null,-8.6168482314693678E-3]
[null,null,null,null,null,null,null,"Household owns sheep",null,-1.9181684041736265E-2,null,null,"Household owns sheep",null,4.0739073545200165E-3]
[null,null,null,null,null,null,null,"Household owns chickens",null,-0.10094919446031794,null,null,"Household owns chickens",null,-8.4598460673009444E-3]
[null,null,null,null,null,null,null,"Household owns pigs",null,-5.8523560037838103E-2,null,null,"Household owns pigs",null,3.1840257698891768E-2]
[null,null,null,null,null,null,null,"Household owns rabbits",null,-3.4922283074079033E-2,null,null,"Household owns rabbits",null,1.4864371306209401E-2]
[null,null,null,null,null,null,null,"Household owns bank account",null,2.8102271997367704E-2,null,null,"Household owns bank account",null,2.8994855795772958E-2]
[]
[]
[null,null,null,null,null,null,null,"Component Score Covariance Matrix",null,null,null,null,"Component Score Covariance Matrix"]
[null,null,null,null,null,null,null,"Component",null,"1",null,null,"Component",null,"1"]
[null,null,null,null,null,null,null,"1",null,0.99999999999999967,null,null,"1",null,1.0000000000000002]
[]
[]
[]
[]
[]
[]
[]
[]
[]
[]
[]
[]
[]
[]
[]
[]
[]
[]
[]
[]
[]
[]
[]
[]
[]
[]
[]
[]
[]
[]
[]
[]
[]
[]
[]
[]
[]
[]
[]
[]
[]
[]
[]
[]
[]
[]
[]
[]
[]
[]
[]
[]
[]
[]
[]
[]
[]
[]
[]
[]
[]
[]
[]
[]
[]
[]
[]
[]
[]
[]
[]
[]
[]
[]
[]
[]
[]
[]
[]
[]
[]
[]
[]
[]
[]
[]
[]
[]
[]
[]
[]
[]
[]
[]
[]
[]
[]
[]
[]
[]
[]
[]
[]
[]
[]
[]
[]
[]
[]
[]
[]
[]
[]
[]
[]
[]
[]
[]
[]
[]
[]
[]
[]
[]
[]
[]
[]
[]
[]
[]
[]
[]
[]
[]
[]
[]
[]
[]
[]
[]
[]
[]
[]
[]
[]
[]
[]
[]
[]
[]
[]
[]
[]
[]
[]
[]
[]
[]
[]
[]
[]
[]
[]
[]
[]
[]
[]
[]
[]
[]
[]
[]
[]
[]
[]
[]
[]
[]
[]
[]
[]
[]
[]
[]
[]
[]
[]
[]
[]
[]
[]
[]
[]
[]
[]
[]
[]
[]
[]
[]
[]
[]
[]
[]
[]
[]
[]
[]
[]
[]
[]
[]
[]
[]
[]
[]
[]
[]
[]
[]
[]
[]
[]
[]
[]
[]
[]
[]
[]
[]
[]
[]
[]
[]
[]
[]
[]
[]
[]
[]
[]
[]
[]
[]
[]
[]
[]
[]
[]
[]
[]
[]
[]
[]
[]
[]
[]
[]
[]
[]
[]
[]
[]
[]
[]
[]
[]
[]
[]
[]
[]
[]
[]
[]
[]
[]
[]
[]
[]
[]
[]
[]
[]
[]
[]
[]
[]
[]
[]
[]
[]
[]
[]
[]
[]
[]
[]
[]
[]
[]
[]
[]
[]
[]
[]
[]
[]
[]
[]
[]
[]
[]
[]
[]
[]
[]
[]
[]
[]
[]
[]
[]
[]
[]
[]
[]
[]
[]
[]
[]
[]
[]
[]
[]
[]
[]
[]
[]
[]
[]
[]
[]
[]
[]
[]
[]
[]
[]
[]
[]
[]
[]
[]
[]
[]
[]
[]
[]
[]
[]
[]
[]
[]
[]
[]
[]
[]
[]
[]
[]
[]
[]
[]
[]
[]
[]
[]
[]
[]
[]
[]
[]
[]
[]
[]
[]
[]
[]
[]
[]
[]
[]
[]
[]
[]
[]
[]
[]
[]
[]
[]
[]
[]
[]
[]
[]
[]
[]
[]
[]
[]
[]
[]
[]
[]
[]
[]
[]
[]
[]
[]
[]
[]
[]
[]
[]
[]
[]
[]
[]
[]
[]
[]
[]
[]
[]
[]
[]
[]
[]
[]
[]
[]
[]
[]
[]
[]
[]
[]
[]
[]
["MICS12"]
["Belarus",null,"Count"]
["W_text_t","",8284]
["W_text_i","",8284]
["S_text_s","",8284]
["S_text_i","",8284]
["Urban/Rural","Urban",5971]
[null,"Rural",2313]
[null,"Missing",0]
["2012"]
[]
["Sub-national region names","Weighted population"]
[{"$f":"R15","v":"Brest region"},{"$f":"BR122+BR123","v":3119.7075900188133}]
[{"$f":"S15","v":"Gomel region"},{"$f":"BS122+BS123","v":3073.2180125524428}]
[{"$f":"T15","v":"Grodno region"},{"$f":"BT122+BT123","v":2270.6080841690041}]
[{"$f":"U15","v":"Minsk city"},{"$f":"BU122+BU123","v":3720.1317772510456}]
[{"$f":"V15","v":"Minsk region"},{"$f":"BV122+BV123","v":3145.7376216477155}]
[{"$f":"W15","v":"Mogilev region"},{"$f":"BW122+BW123","v":2354.9599840141254}]
[{"$f":"X15","v":"Vitebsk region"},{"$f":"BX122+XR123","v":2667.3231510831611}]
[{"$f":"Y15","v":0},{"$f":"BY122+BY123","v":0}]
[{"$f":"Z15","v":0},{"$f":"BZ122+BZ123","v":0}]
[{"$f":"AA15","v":0},{"$f":"CA122+CA123","v":0}]
[{"$f":"AB15","v":0},{"$f":"CB122+CB123","v":0}]
[{"$f":"AC15","v":0},{"$f":"CC122+CC123","v":0}]
[{"$f":"AD15","v":0},{"$f":"CD122+CD123","v":0}]
[{"$f":"AE15","v":0},{"$f":"CE122+CE123","v":0}]
[{"$f":"AF15","v":0},{"$f":"CF122+CF123","v":0}]
[{"$f":"AG15","v":0},{"$f":"CG122+CG123","v":0}]
[{"$f":"AH15","v":0},{"$f":"CH122+CH123","v":0}]
[{"$f":"AI15","v":0},{"$f":"CI122+CI123","v":0}]
[{"$f":"AJ15","v":0},{"$f":"CJ122+CJ123","v":0}]
[{"$f":"AK15","v":0},{"$f":"CK122+CK123","v":0}]
[{"$f":"AL15","v":0},{"$f":"CL122+CL123","v":0}]
[{"$f":"AM15","v":0},{"$f":"CM122+CM123","v":0}]
[{"$f":"AN15","v":0},{"$f":"CN122+CN123","v":0}]
[{"$f":"AO15","v":0},{"$f":"CO122+CO123","v":0}]
[{"$f":"AP15","v":0},{"$f":"CP122+CP123","v":0}]
[{"$f":"AQ15","v":0},{"$f":"CQ122+CQ123","v":0}]
[{"$f":"AR15","v":0},{"$f":"CR122+CR123","v":0}]
[{"$f":"AS15","v":0},{"$f":"CS122+CS123","v":0}]
[{"$f":"AT15","v":0},{"$f":"CT122+CT123","v":0}]
[{"$f":"AU15","v":0},{"$f":"CU122+CU123","v":0}]
[{"$f":"AV15","v":0},{"$f":"CV122+CV123","v":0}]
[{"$f":"AW15","v":0},{"$f":"CW122+CW123","v":0}]
[{"$f":"AX15","v":0},{"$f":"CX122+CX123","v":0}]
[{"$f":"AY15","v":0},{"$f":"CY122+CY123","v":0}]
[]
[{"$f":"34-COUNTIF(A1037:A1071,\"0\")","v":7},"Sub-regions"]

{"sheet":"data_summary","index":6,"n_rows":103,"n_cols":58,"rows_kept":103,"cut":false,"hidden":false,"merged":[]}
["iso3","year","data_source","row","var1","var2","varname","total_q1","total_q2","total_q3","total_q4","total_q5","urban_q1","urban_q2","urban_q3","urban_q4","urban_q5","rural_q1","rural_q2","rural_q3","rural_q4","rural_q5","region_1_name","region_2_name","region_3_name","region_4_name","region_5_name","region_6_name","region_7_name","region_1","region_2","region_3","region_4","region_5","region_6","region_7","n_total_q1","n_total_q2","n_total_q3","n_total_q4","n_total_q5","n_urban_q1","n_urban_q2","n_urban_q3","n_urban_q4","n_urban_q5","n_rural_q1","n_rural_q2","n_rural_q3","n_rural_q4","n_rural_q5","n_region_1","n_region_2","n_region_3","n_region_4","n_region_5","n_region_6","n_region_7"]
["BLR",2005,"BLR_2005_MICS",16,"Water","Improved","w_imp",98.707564251832835,99.459079402752266,99.962174886417841,100,99.971818448206363,99.084816667990268,99.942851436570834,100,100,99.957358266827356,98.297895386308028,98.675599898484407,99.401109117264042,100,100,"Brest","Gomel","Grodno","Minsk","Minsk city","Mogilev","Vitebsk",100,99.773295091844574,98.34785421692284,99.413500485578226,100,99.8115067354627,99.825864721143247]
["BLR",2005,"BLR_2005_MICS",17,"Water","Not Improved","",1.292435748167134,0.54092059724774677,0.037825113582160098,0,0.028181551793645201,0.91518333200976032,0.0571485634291811,0,0,0.042641733172628198,1.7021046136919911,1.324400101515594,0.59889088273593372,0,0,"Brest","Gomel","Grodno","Minsk","Minsk city","Mogilev","Vitebsk",0,0.2267049081553994,1.6521457830771451,0.5864995144217604,0,0.18849326453734869,0.1741352788567509]
["BLR",2005,"BLR_2005_MICS",18,"Water ladder","Basic","w_bas",98.572769879776629,99.459079402752266,99.962174886417827,99.950265219397522,99.929053669804802,98.880607464916665,99.942851436570834,99.924503840986247,100,99.892611213564138,98.297895386308028,98.675599898484421,99.401109117264042,100,100,"Brest","Gomel","Grodno","Minsk","Minsk city","Mogilev","Vitebsk",100,99.773295091844574,98.279345974989042,99.413500485578226,100,99.8115067354627,99.558350747679683]
["BLR",2005,"BLR_2005_MICS",19,"Water ladder","Limited","w_lim",0.1347943720562052,0,0,0.049734780602466798,0.042764778401552697,0.2042092030735996,0,0.075496159013745401,0,0.064747053263193202,0,0,0,0,0,"Brest","Gomel","Grodno","Minsk","Minsk city","Mogilev","Vitebsk",0,0,0.068508241933802394,0,0,0,0.26751397346355321]
["BLR",2005,"BLR_2005_MICS",20,"Water ladder","Unimproved","w_unimp",1.2924357481671651,0.54092059724773378,0.037825113582172797,1.0901002323000001e-14,0.028181551793645801,0.91518333200973578,0.057148563429166202,7.2580830234899996e-15,0,0.042641733172669297,1.702104613691972,1.3244001015155791,0.59889088273595803,0,0,"Brest","Gomel","Grodno","Minsk","Minsk city","Mogilev","Vitebsk",0,0.22670490815542621,1.652145783077156,0.58649951442177439,0,0.18849326453729989,0.1741352788567643]
["BLR",2005,"BLR_2005_MICS",21,"Water ladder","Surface water","w_sur",0,0,0,0,0,0,0,0,0,0,0,0,0,0,0,"Brest","Gomel","Grodno","Minsk","Minsk city","Mogilev","Vitebsk",0,0,0,0,0,0,0]
["BLR",2005,"BLR_2005_MICS",22,"Improved water point at more than 30 minutes","Yes","",0.13655931344056271,0,0,0.049734780602466798,0.042776833577062898,0.20609535339592569,0,0.075496159013745401,0,0.064774674306974603,0,0,0,0,0,"Brest","Gomel","Grodno","Minsk","Minsk city","Mogilev","Vitebsk",0,0,0.069659112015495406,0,0,0,0.26798062226742059]
["BLR",2005,"BLR_2005_MICS",23,"Improved water point at more than 30 minutes","No","",99.863440686559429,100,100,99.950265219397522,99.957223166422921,99.793904646604076,100,99.924503840986247,100,99.935225325693011,100,100,100,100,100,"Brest","Gomel","Grodno","Minsk","Minsk city","Mogilev","Vitebsk",100,100,99.930340887984514,100,100,100,99.73201937773257]
["BLR",2005,"BLR_2005_MICS",29,"Piped water","Yes","w_pip",52.641690944063427,87.721372857878933,98.308983119601194,99.373925638162603,99.07229967531363,86.329949730883044,99.384427597328894,99.861590375141461,99.84395116861829,99.82993905290185,36.632681265291858,50.367195473941159,72.627104138017131,90.976668779793229,92.523318490125135,"Brest","Gomel","Grodno","Minsk","Minsk city","Mogilev","Vitebsk",85.185866090792487,90.961666911657119,78.724526580896239,82.176022003711651,100,92.373914061340471,81.000434106913417]
["BLR",2005,"BLR_2005_MICS",30,"Piped water","No","",47.358309055936417,12.278627142121239,1.691016880398805,0.62607436183739185,0.92770032468638564,13.67005026911686,0.61557240267109703,0.1384096248585332,0.15604883138169429,0.1700609470981255,63.367318734708341,49.632804526058692,27.372895861982919,9.0233312202067548,7.4766815098748616,"Brest","Gomel","Grodno","Minsk","Minsk city","Mogilev","Vitebsk",14.814133909207481,9.0383330883428901,21.275473419103999,17.8239779962882,0,7.6260859386597009,18.99956589308654]
["BLR",2005,"BLR_2005_MICS",31,"Piped water on premises","Yes","w_pop",35.489863333295759,81.500927020591263,98.108364233068869,99.332738951918913,98.897798569977112,69.147847420155273,99.214166415724819,99.861590375141461,99.697115503174018,99.651183490219381,21.289029784195211,39.754883065718978,64.738783640714146,89.248753431575238,92.393350028167404,"Brest","Gomel","Grodno","Minsk","Minsk city","Mogilev","Vitebsk",83.121702886335797,85.827261789947784,77.627966695569995,76.777268051741174,99.358083354202947,80.364232104738463,72.821374500119447]
["BLR",2005,"BLR_2005_MICS",32,"Piped water on premises","No","",64.510136666704014,18.499072979408769,1.8916357669311481,0.66726104808107567,1.1022014300229019,30.852152579844621,0.78583358427515271,0.1384096248585332,0.30288449682597818,0.34881650978058643,78.710970215805034,60.245116934280951,35.26121635928591,10.751246568424669,7.6066499718325904,"Brest","Gomel","Grodno","Minsk","Minsk city","Mogilev","Vitebsk",16.87829711366421,14.172738210052181,22.372033304430271,23.222731948258609,0.64191664579707441,19.635767895261701,27.178625499880379]
["BLR",2005,"BLR_2005_MICS",35,"Water source on premises","Yes","",35.489863333295759,81.500927020591263,98.108364233068869,99.332738951918913,98.897798569977112,69.147847420155273,99.214166415724819,99.861590375141461,99.697115503174018,99.651183490219381,21.289029784195211,39.754883065718978,64.738783640714146,89.248753431575238,92.393350028167404,"Brest","Gomel","Grodno","Minsk","Minsk city","Mogilev","Vitebsk",83.121702886335797,85.827261789947784,77.627966695569995,76.777268051741174,99.358083354202947,80.364232104738463,72.821374500119447]
["BLR",2005,"BLR_2005_MICS",36,"Water source on premises","No","",64.510136666704014,18.499072979408769,1.8916357669311481,0.66726104808107567,1.1022014300229019,30.852152579844621,0.78583358427515271,0.1384096248585332,0.30288449682597818,0.34881650978058643,78.710970215805034,60.245116934280951,35.26121635928591,10.751246568424669,7.6066499718325904,"Brest","Gomel","Grodno","Minsk","Minsk city","Mogilev","Vitebsk",16.87829711366421,14.172738210052181,22.372033304430271,23.222731948258609,0.64191664579707441,19.635767895261701,27.178625499880379]
["BLR",2005,"BLR_2005_MICS",37,"Improved Water source on premises","Yes","w_premises",35.954552827127188,81.944179968285468,98.145487875333473,99.332738951918913,98.925677360979805,69.786522037834843,99.270898308011084,99.861590375141461,99.697115503174018,99.6936946094647,21.65766591495159,40.28846351744307,65.128834291317048,89.248753431575238,92.393350028167404,"Brest","Gomel","Grodno","Minsk","Minsk city","Mogilev","Vitebsk",83.121702886335797,86.022278517453969,78.932039050235275,77.230222934237332,99.358083354202947,80.515999340369973,72.948403405811717]
["BLR",2005,"BLR_2005_MICS",38,"Improved Water source on premises","No","",64.045447172872599,18.055820031714539,1.8545121246665379,0.66726104808107567,1.074322639020203,30.213477962165019,0.7291016919888812,0.1384096248585332,0.30288449682597818,0.30630539053528372,78.34233408504862,59.711536482556852,34.87116570868303,10.751246568424669,7.6066499718325904,"Brest","Gomel","Grodno","Minsk","Minsk city","Mogilev","Vitebsk",16.87829711366421,13.977721482546009,21.067960949764998,22.769777065762469,0.64191664579707441,19.484000659630158,27.051596594188119]
["BLR",2005,"BLR_2005_MICS",41,"Water point at more than 30 minutes","Yes","",0.17414789802948599,0,0,0.049734780602466798,0.070979648437110604,0.26382273698661202,0,0.075496159013745401,0,0.1074650979428031,0,0,0,0,0,"Brest","Gomel","Grodno","Minsk","Minsk city","Mogilev","Vitebsk",0,0.037302600865105701,0.068508241933802394,0,0,0.065281407826269802,0.26751397346355321]
["BLR",2005,"BLR_2005_MICS",42,"Water point at more than 30 minutes","No","w_30min",99.825852101970497,100,100,99.950265219397522,99.929020351562883,99.736177263013403,100,99.924503840986247,100,99.892534902057179,100,100,100,100,100,"Brest","Gomel","Grodno","Minsk","Minsk city","Mogilev","Vitebsk",100,99.962697399134854,99.931491758066187,100,100,99.934718592173724,99.732486026536435]
["BLR",2005,"BLR_2005_MICS",58,"Main source of drinking water","Piped into dwelling","",28.123228879048099,78.082844823584693,97.280763308164495,98.746884713655859,97.083587371150657,66.008473809156513,98.441829056705913,99.23607013486405,97.972437976515323,98.146722821478477,12.605247453149721,31.936762867622861,58.643723124523703,86.131331452007956,91.908069480993987,"Brest","Gomel","Grodno","Minsk","Minsk city","Mogilev","Vitebsk",78.119658625301597,82.070335229398566,75.532788435025694,75.121164755036759,96.541623505881489,77.495807441499991,71.544135120671754]
["BLR",2005,"BLR_2005_MICS",59,"Main source of drinking water","Piped into yard or plot","",7.3666344542476807,3.3329623078646211,0.0472813919777001,0.0324921092009356,0.094326325498913594,3.1393736109987498,0.071435704286476304,0,0,0.14272592341725271,8.6837823310454851,7.8181201980961168,6.0113620381548429,2.9495787276954961,0.096047349319877504,"Brest","Gomel","Grodno","Minsk","Minsk city","Mogilev","Vitebsk",5.0020442610342544,3.5731550946146542,2.008514273998967,1.370088398191103,0,2.568580134231345,0.84531160683781814]
["BLR",2005,"BLR_2005_MICS",60,"Main source of drinking water","Public tap/standpipe","",17.151827610767821,6.1846166017935813,0.20061888653234289,0.041186686243683802,0.17450110533651639,17.182102310727771,0.1702611816040559,0,0.146835665444284,0.17875556268246101,15.343651481096661,10.61231240822222,7.7826277205529264,1.727915348217917,0.12996846195772699,"Brest","Gomel","Grodno","Minsk","Minsk city","Mogilev","Vitebsk",2.0641632044567331,5.0869498264079356,1.0965598853262619,5.3987539519703978,0.64191664579707441,12.009681956602011,8.1790596067938406]
["BLR",2005,"BLR_2005_MICS",61,"Main source of drinking water","Protected well","",46.065873307769309,11.73770654487349,1.6531917668166449,0.62607436183739185,0.8995187728927404,12.754866937107099,0.55842383924191596,0.1384096248585332,0.15604883138169429,0.12741921392549729,61.665214121016341,48.308404424543092,26.774004979246989,9.0233312202067548,7.4766815098748616,"Brest","Gomel","Grodno","Minsk","Minsk city","Mogilev","Vitebsk",14.814133909207481,8.8116281801874887,19.62332763602684,17.237478481866439,0,7.4375926741223521,18.825430614229791]
["BLR",2005,"BLR_2005_MICS",62,"Main source of drinking water","Unprotected well","",1.020504544121974,0.54092059724774677,0,0,0,0.74147643366127425,0,0,0,0,1.5770217127366151,0.98565766041444525,0.59889088273593372,0,0,"Brest","Gomel","Grodno","Minsk","Minsk city","Mogilev","Vitebsk",0,0.18940230729029381,1.591400394563705,0.3871246275975786,0,0.053532937968847998,0.12731215690827319]
["BLR",2005,"BLR_2005_MICS",63,"Main source of drinking water","Bottled water","",0,0.1209491246358629,0.78031953292666556,0.55336212906211579,1.7198848733275769,0,0.70090165473248667,0.62552024027739028,1.7246775266587311,1.361734745323596,0,0,0.18939125478562391,0.1678432518717986,0.38923319785355132,"Brest","Gomel","Grodno","Minsk","Minsk city","Mogilev","Vitebsk",0,0.23122676123584479,0.086663986545361199,0.28601489851333989,2.816459848321565,0.29984452900714981,0.43192777260987281]
["BLR",2005,"BLR_2005_MICS",64,"Main source of drinking water","Other","",0.2719312040451598,0,0.037825113582160098,0,0.028181551793645201,0.17370689834848599,0.0571485634291811,0,0,0.042641733172628198,0.1250829009553758,0.33874244110114882,0,0,0,"Brest","Gomel","Grodno","Minsk","Minsk city","Mogilev","Vitebsk",0,0.037302600865105701,0.060745388513439601,0.19937488682418181,0,0.13496032656850079,0.046823121948477701]
["BLR",2005,"BLR_2005_MICS",122,"Sanitation","Improved","s_imp",98.239861359486994,98.651259593054718,99.801825638817519,100,100,97.834398290734342,99.874499663141961,100,100,100,98.512848825766426,97.987371646490146,99.653335793366409,98.894977045079415,99.659707455649865,"Brest","Gomel","Grodno","Minsk","Minsk city","Mogilev","Vitebsk",99.946075681058687,99.903237324642831,99.009220434772345,99.854561098461232,100,99.930024121917896,96.493245134370639,3519.8918975802781,3534.5361882168258,3578.1481335603248,3584.959556302113,3580.608752372144,2319.3891263837222,2370.0055885743682,2361.6721609498081,2379.9859890976181,2366.3932842328172,1195.8014827640659,1187.9469840184679,1210.358076032119,1197.953434283281,1208.638401695478,2649.3733564096678,2702.478332598504,2210.3568724370348,2833.4564123318919,2849.0304062087312,2168.2621548168472,2385.186993229006]
["BLR",2005,"BLR_2005_MICS",123,"Sanitation","Not Improved","",1.760138640512994,1.348740406945278,0.19817436118248519,0,0,2.165601709265661,0.12550033685801679,0,0,0,1.487151174233611,2.012628353509927,0.34666420663358188,1.105022954920557,0.34029254435013229,"Brest","Gomel","Grodno","Minsk","Minsk city","Mogilev","Vitebsk",0.0539243189413042,0.096762675357150205,0.99077956522764499,0.14543890153878039,0,0.069975878082111406,3.5067548656293681,63.065008985391422,48.32347601564728,7.1050525984448392,0,0,51.340562668176403,2.9781025259166598,0,0,0,18.051833851522339,24.40003994726818,4.2104744294786958,13.38557410459306,4.1269500725281798,1.42942734761825,2.6175231209695591,22.118913889579279,4.1269500725281798,0,1.5183229417658199,86.682400227022427]
["BLR",2005,"BLR_2005_MICS",124,"Sanitation ladder","Basic","s_bas",92.409178885559697,94.017411565517079,91.084748106366149,94.12108547501353,93.44143185284338,87.699167949627864,87.681663764369091,94.390082533445536,92.621106072560522,93.702600325432613,96.870802572480315,94.323572886468753,96.746490252223197,96.148837152551266,98.554923582790337,"Brest","Gomel","Grodno","Minsk","Minsk city","Mogilev","Vitebsk",93.276639507743369,97.0976817220416,91.805373818974189,93.677450818611092,88.411869580643938,95.347386814438821,91.853683518717631,3310.9810571807861,3368.5119163363479,3265.618833588182,3374.2028482317778,3345.7720872647628,2079.1102116333141,2080.6715812138668,2229.1843018899299,2204.369347474184,2217.3720412525549,1175.869449858191,1143.5290287872549,1175.052444278899,1164.688370540187,1195.239965673517,2472.5797566665101,2626.585364262633,2049.5327410552318,2658.1757587534921,2518.8810470501539,2068.8289851526829,2270.5030896611461]
["BLR",2005,"BLR_2005_MICS",125,"Sanitation ladder","Limited","s_lim",5.8306824739272356,4.633848027537657,8.7170775324514409,5.8789145249865786,6.5585681471567518,10.135230341106389,12.19283589877273,5.6099174665544247,7.3788939274395897,6.2973996745672416,1.642046253286146,3.663798760021356,2.9068455411432512,2.7461398925281779,1.1047838728595449,"Brest","Gomel","Grodno","Minsk","Minsk city","Mogilev","Vitebsk",6.6694361733153196,2.8055556026012551,7.2038466157981436,6.1771102798500932,11.58813041935627,4.5826373074791249,4.639561615652946,208.9108403994899,166.02427188047881,312.52929997214562,210.7567080703393,234.83666510738621,240.27891475040511,289.33400736049771,132.4878590598766,175.6166416234372,149.02124298025839,19.932032905875879,44.41795523121241,35.305631753221178,33.265063743094672,13.39843602196126,176.7935997431579,75.892968335872069,160.82413138180291,175.28065357839941,330.14935915858348,99.43316966416495,114.6839035678592]
["BLR",2005,"BLR_2005_MICS",126,"Sanitation ladder","Unimproved","s_unimp",1.7601386405130659,1.348740406945264,0.19817436118241011,-1.08357767203e-13,-1.3145040611599999e-13,2.1656017092657511,0.1255003368581811,3.9079850466800001e-14,-1.11910480882e-13,1.4566126083099999e-13,1.487151174233539,2.012628353509891,0.34666420663355257,1.105022954920555,0.34029254435011769,"Brest","Gomel","Grodno","Minsk","Minsk city","Mogilev","Vitebsk",0.053924318941311902,0.096762675357145306,0.9907795652276663,0.1454389015388147,-2.0783375021e-13,0.069975878082054493,3.5067548656294232,63.065008985391422,48.32347601564728,7.1050525984448392,0,0,51.340562668176403,2.9781025259166598,0,0,0,18.051833851522339,24.40003994726818,4.2104744294786958,13.38557410459306,4.1269500725281798,1.42942734761825,2.6175231209695591,22.118913889579279,4.1269500725281798,0,1.5183229417658199,86.682400227022427]
["BLR",2005,"BLR_2005_MICS",127,"Sanitation ladder","Open defecation","s_od",0,0,0,0,0,0,0,0,0,0,0,0,0,0,0,"Brest","Gomel","Grodno","Minsk","Minsk city","Mogilev","Vitebsk",0,0,0,0,0,0,0,192.26725818665821,1747.7209647549601,3394.619218016458,3546.892191263039,3580.608752372144,794.06131313113269,2274.2206876238261,2344.7582824972742,2367.045970318276,2366.3932842328172,2.3928394246073448,75.724537849947765,311.86781429982869,788.67445879822196,1136.9691964173651,1706.148853159576,1778.5910454146599,1410.6107170320131,1719.5372419635621,2822.1625014376209,1360.3636485920961,1664.694376993725]
["BLR",2005,"BLR_2005_MICS",128,"Shared among Improved Sanitation","Yes","s_shared",5.935149330668481,4.6972010764512238,8.7343868477902564,5.8789145249865786,6.5585681471567518,10.35957752915037,12.208157177154209,5.6099174665544256,7.3788939274395897,6.2973996745672407,1.6668346036671129,3.7390519803299491,2.9169575890270898,2.776824440008113,1.1085562069818351,"Brest","Gomel","Grodno","Minsk","Minsk city","Mogilev","Vitebsk",6.6730345617554647,2.808272962651249,7.2759350938876102,6.186107286335349,11.58813041935627,4.5858462936906301,4.8081724365184053]
["BLR",2005,"BLR_2005_MICS",129,"Shared among Improved Sanitation","No","",94.064850669331463,95.302798923548806,91.265613152209809,94.12108547501353,93.44143185284338,89.640422470849529,87.791842822845652,94.390082533445536,92.621106072560522,93.702600325432613,98.33316539633293,96.260948019670025,97.083042410972936,97.223175559991915,98.891443793018183,"Brest","Gomel","Grodno","Minsk","Minsk city","Mogilev","Vitebsk",93.326965438244542,97.19172703734877,92.724064906112375,93.8138927136646,88.411869580643952,95.41415370630942,95.191827563481525]
["BLR",2005,"BLR_2005_MICS",135,"Sanitation type","Sewer connection","s_sew",5.3661616145685089,48.780056394683271,94.682831079314738,98.938136834147699,100,33.494384315433848,95.838024346864941,99.283817680870172,99.456298531225855,100,0.1971275599657259,6.2461107548434081,25.67725092019738,65.107657999707214,93.75013845504877,"Brest","Gomel","Grodno","Minsk","Minsk city","Mogilev","Vitebsk",64.363477494966844,65.74964956062928,63.185935797004802,60.598651117918727,99.05694566430185,62.695911523609738,67.345563701739223]
["BLR",2005,"BLR_2005_MICS",136,"Sanitation type","Septic tank connection","s_sep",2.9576756108918238,8.1892923508944939,2.2582651297223948,1.024054263577111,0,5.936527458666979,1.3095780954281431,0.71618231912980757,0.54370146877414949,0,0.44966779639696491,2.9638029885515471,10.67776862776409,8.2600890824574247,3.649030061724821,"Brest","Gomel","Grodno","Minsk","Minsk city","Mogilev","Vitebsk",5.2561797635872569,0.99151711094837158,1.9846467488737809,4.9523016136836757,0,4.4223706719236233,2.836675791349716]
["BLR",2005,"BLR_2005_MICS",137,"Sanitation type","Improved latrines","s_lat",89.916024134026557,41.681910847477042,2.860729429780422,0.037808902275167297,0,58.403486516633272,2.7268972208487781,0,0,0,97.866053469403766,88.777457903095154,63.298316245404983,25.5272299629146,2.260538938876286,"Brest","Gomel","Grodno","Minsk","Minsk city","Mogilev","Vitebsk",30.326418422504769,33.162070653065101,33.838637888894283,34.303608366858782,0.94305433569817165,32.81174192638462,26.311005641281412]
["BLR",2005,"BLR_2005_MICS",138,"Sanitation type","Unimproved facilities","",1.760138640512994,1.348740406945278,0.19817436118248519,0,0,2.165601709265661,0.12550033685801679,0,0,0,1.487151174233611,2.012628353509927,0.34666420663358188,1.105022954920557,0.34029254435013229,"Brest","Gomel","Grodno","Minsk","Minsk city","Mogilev","Vitebsk",0.0539243189413042,0.096762675357150205,0.99077956522764499,0.14543890153878039,0,0.069975878082111406,3.5067548656293681]
["BLR",2005,"BLR_2005_MICS",139,"Sanitation type","Open defecation","",0,0,0,0,0,0,0,0,0,0,0,0,0,0,0,"Brest","Gomel","Grodno","Minsk","Minsk city","Mogilev","Vitebsk",0,0,0,0,0,0,0]
["BLR",2005,"BLR_2005_MICS",148,"Shared among improved sanitation facilities","Yes","",5.8306824739272356,4.6338480275376579,8.7170775324514409,5.8789145249865786,6.5585681471567518,10.135230341106389,12.19283589877273,5.6099174665544256,7.3788939274395897,6.2973996745672407,1.642046253286146,3.663798760021356,2.9068455411432512,2.7461398925281779,1.1047838728595449,"Brest","Gomel","Grodno","Minsk","Minsk city","Mogilev","Vitebsk",6.6694361733153187,2.8055556026012551,7.2038466157981453,6.1771102798500923,11.58813041935627,4.582637307479124,4.639561615652946]
["BLR",2005,"BLR_2005_MICS",149,"Shared among improved sanitation facilities","No","",92.409178885559697,94.017411565517079,91.084748106366149,94.12108547501353,93.44143185284338,87.699167949627835,87.681663764369105,94.390082533445536,92.621106072560522,93.702600325432613,96.870802572480329,94.323572886468767,96.746490252223168,96.148837152551266,98.554923582790337,"Brest","Gomel","Grodno","Minsk","Minsk city","Mogilev","Vitebsk",93.276639507743369,97.0976817220416,91.805373818974203,93.677450818611092,88.411869580643952,95.347386814438821,91.853683518717617]
["BLR",2005,"BLR_2005_MICS",150,"Shared among improved sanitation facilities","DK/missing","",1.760138640512994,1.348740406945278,0.19817436118248519,0,0,2.165601709265661,0.12550033685801679,0,0,0,1.487151174233611,2.012628353509927,0.34666420663358188,1.105022954920557,0.34029254435013229,"Brest","Gomel","Grodno","Minsk","Minsk city","Mogilev","Vitebsk",0.0539243189413042,0.096762675357150205,0.99077956522764499,0.14543890153878039,0,0.069975878082111406,3.5067548656293681]
["BLR",2005,"BLR_2005_MICS",151,"Shared among all sanitation facilities","Yes","",6.0375065621747934,4.7596562606572901,8.7170775324514409,5.8789145249865786,6.5585681471567518,10.4388273756028,12.19283589877273,5.6099174665544256,7.3788939274395897,6.2973996745672407,1.9013024745846649,3.7935879284093859,2.9068455411432512,2.7461398925281779,1.1047838728595449,"Brest","Gomel","Grodno","Minsk","Minsk city","Mogilev","Vitebsk",6.6694361733153187,2.8055556026012551,7.3928458663975762,6.1771102798500923,11.58813041935627,4.582637307479124,4.9510096196390876]
["BLR",2005,"BLR_2005_MICS",152,"Shared among all sanitation facilities","No","",93.962493437825174,95.240343739342777,91.28292246754863,94.12108547501353,93.44143185284338,89.561172624397059,87.807164101227116,94.390082533445536,92.621106072560522,93.702600325432613,98.098697525415375,96.206412071590648,97.093154458856745,97.253860107471795,98.895216127140472,"Brest","Gomel","Grodno","Minsk","Minsk city","Mogilev","Vitebsk",93.330563826684681,97.194444397398755,92.607154133602407,93.82288972014986,88.411869580643952,95.417362692520925,95.048990380360877]
["BLR",2005,"BLR_2005_MICS",153,"Kind of toilet facility","Flush to piped sewer system","",5.3661616145685089,48.780056394683271,94.682831079314738,98.938136834147699,100,33.494384315433848,95.838024346864941,99.283817680870172,99.456298531225855,100,0.1971275599657259,6.2461107548434081,25.67725092019738,65.107657999707214,93.75013845504877,"Brest","Gomel","Grodno","Minsk","Minsk city","Mogilev","Vitebsk",64.363477494966844,65.74964956062928,63.185935797004802,60.598651117918727,99.05694566430185,62.695911523609738,67.345563701739223,192.26725818665821,1747.7209647549601,3394.619218016458,3546.892191263039,3580.608752372144,794.06131313113269,2274.2206876238261,2344.7582824972742,2367.045970318276,2366.3932842328172,2.3928394246073448,75.724537849947765,311.86781429982869,788.67445879822196,1136.9691964173651,1706.148853159576,1778.5910454146599,1410.6107170320131,1719.5372419635621,2822.1625014376209,1360.3636485920961,1664.694376993725]
["BLR",2005,"BLR_2005_MICS",154,"Kind of toilet facility","Flush to septic tank","",2.9576756108918238,8.1892923508944939,2.2582651297223948,1.024054263577111,0,5.936527458666979,1.3095780954281431,0.71618231912980757,0.54370146877414949,0,0.44966779639696491,2.9638029885515471,10.67776862776409,8.2600890824574247,3.649030061724821,"Brest","Gomel","Grodno","Minsk","Minsk city","Mogilev","Vitebsk",5.2561797635872569,0.99151711094837158,1.9846467488737809,4.9523016136836757,0,4.4223706719236233,2.836675791349716,105.972242574257,293.41085242627418,80.964522515284642,36.711931183826877,0,140.7390189613362,31.076074626731572,16.913878452533378,12.94001877934272,0,5.4583074603167869,35.931577327912187,129.68881964387759,100.05768118339481,44.254172264197308,139.33095949245819,26.821488277013859,44.306758112725539,140.52568664597359,0,95.955735493521161,70.118920677950243]
["BLR",2005,"BLR_2005_MICS",155,"Kind of toilet facility","Flush to pit (latrine)","",1.7267562649645489,4.2852759386192867,0.45890588699849832,0,0,7.5543535832468356,0.65644724733612447,0,0,0,0,0.41156472549273809,0.85557735200694296,1.5763193107643421,0.22352780004318989,"Brest","Gomel","Grodno","Minsk","Minsk city","Mogilev","Vitebsk",0,4.6340868000686797,1.138265137380265,1.5569095746413799,0.88163586059235599,0.2044315459813873,0.29762550509725572,61.868932855102692,153.53542310584999,16.452937935083831,0,0,179.09330321398869,15.577386119962981,0,0,0,0,4.9895927012039571,10.39157344234845,19.09457070803936,2.7108677104930772,0,125.356489979101,25.4114935762118,44.178607057705229,25.118073740316241,4.4357157750842626,7.3569137676179768]
["BLR",2005,"BLR_2005_MICS",156,"Kind of toilet facility","Ventilated Improved Pit latrine (VIP)","",0.72418315031113478,1.1250950597658571,0.095819696255157599,0,0,2.0123685929607422,0.10795510277550981,0,0,0,0.22665836231540509,0.22888577195659679,0.86090778856820427,0.21194912697880061,0.072035511989908194,"Brest","Gomel","Grodno","Minsk","Minsk city","Mogilev","Vitebsk",0,0.41631665240321841,0.34987373165316632,0.096959267692520307,0,0.064984448486389401,1.879516585258866,25.947170200257649,40.31057708062314,3.4353787129556941,0,0,47.707819686476263,2.5617569825733999,0,0,0,2.7513000483521202,2.7748898445968,10.45631524842384,2.5674224530317602,0.87362173038229374,0,11.26176451082951,7.8108463418742939,2.7513000483521202,0,1.41001987683678,46.45919521594378]
["BLR",2005,"BLR_2005_MICS",157,"Kind of toilet facility","Pit latrine with slab","",87.34990191917646,36.271539849091958,2.306003846526766,0.037808902275167297,0,48.836764340425667,1.962494870737143,0,0,0,97.639395107088362,87.796597441258839,61.58183110482981,23.738961525171451,1.9649756268431879,"Brest","Gomel","Grodno","Minsk","Minsk city","Mogilev","Vitebsk",30.326418422504769,28.111667200593232,32.350499019860827,32.504300622986086,0.061418475105815697,32.542325931916842,24.13386355092527,3129.7093436914711,1299.558370849124,82.676076380544657,1.355433855246539,0,1157.787671390782,46.569683221272037,0,0,0,1185.1990358307901,1064.3994362222779,747.95355339764114,287.55930114059078,23.830543573040369,803.89354375763889,760.44754441689804,722.21705737422178,922.33662654376951,1.74983103079443,706.0970350793101,596.55758657376214]
["BLR",2005,"BLR_2005_MICS",158,"Kind of toilet facility","Pit latrine without slab/open pit","",1.6380970791025899,1.348740406945278,0.19817436118248519,0,0,2.1115728380197392,0.12550033685801679,0,0,0,1.362068273278235,1.882839185121898,0.34666420663358188,1.105022954920557,0.34029254435013229,"Brest","Gomel","Grodno","Minsk","Minsk city","Mogilev","Vitebsk",0.0539243189413042,0.049412098534576801,0.99077956522764499,0.14543890153878039,0,0,3.4430987871752312,58.692312431956744,48.32347601564728,7.1050525984448392,0,0,50.059684176889697,2.9781025259166598,0,0,0,16.533510909756519,22.826544826886021,4.2104744294786958,13.38557410459306,4.1269500725281798,1.42942734761825,1.3366446296828589,22.118913889579279,4.1269500725281798,0,0,85.10890510664025]
["BLR",2005,"BLR_2005_MICS",159,"Kind of toilet facility","Composting toilet","",0.1151827995744425,0,0,0,0,0,0,0,0,0,0,0.3404099643869643,0,0,0,"Brest","Gomel","Grodno","Minsk","Minsk city","Mogilev","Vitebsk",0,0,0,0.14543890153878039,0,0,0,4.1269500725281798,0,0,0,0,0,0,0,0,0,0,4.1269500725281798,0,0,0,0,0,0,4.1269500725281798,0,0,0]
["BLR",2005,"BLR_2005_MICS",160,"Kind of toilet facility","Bucket","",0.1220415614104048,0,0,0,0,0.054028871245922101,0,0,0,0,0.1250829009553758,0.12978916838803009,0,0,0,"Brest","Gomel","Grodno","Minsk","Minsk city","Mogilev","Vitebsk",0,0.047350576822573397,0,0,0,0.069975878082111406,0.063656078454136594,4.3726965534346807,0,0,0,0,1.2808784912866999,0,0,0,0,1.5183229417658199,1.5734951203821601,0,0,0,0,1.2808784912866999,0,0,0,1.5183229417658199,1.5734951203821601]
["BLR",2012,"BLR_2012_MICS",16,"Water","Improved","w_imp",98.941110389847438,99.577495790156675,99.814908154647057,99.864516672544241,99.896315816451249,99.796039748657194,99.688424085306508,100,99.813098272245966,99.856809974862273,98.105715678449812,98.694271497738882,99.008206290331316,99.94784515496319,99.550508079031985,"Brest region","Gomel region","Grodno region","Minsk city","Minsk region","Mogilev region","Vitebsk region",99.50143819137368,99.923504456998714,99.586991872496952,99.886273650945085,99.394256644801388,99.557061699203217,99.382995235631654]
["BLR",2012,"BLR_2012_MICS",17,"Water","Not Improved","",1.0588896101525831,0.42250420984330672,0.18509184535297249,0.13548332745576169,0.10368418354875911,0.2039602513428028,0.31157591469348211,0,0.18690172775403141,0.14319002513771811,1.8942843215501339,1.3057285022610909,0.99179370966867353,0.052154845036810303,0.44949192096803148,"Brest region","Gomel region","Grodno region","Minsk city","Minsk region","Mogilev region","Vitebsk region",0.49856180862631938,0.076495543001262406,0.41300812750304322,0.1137263490549052,0.60574335519863565,0.44293830079675062,0.61700476436835328]
["BLR",2012,"BLR_2012_MICS",18,"Water ladder","Basic","w_bas",98.669675838816531,99.50174122144746,99.814908154647057,99.839657986820853,99.896315816451249,99.717055517031227,99.662855664411666,99.965702713867628,99.813098272245966,99.856809974862287,97.834176031037146,97.981125077332948,99.008206290331316,99.947845154963204,99.550508079031985,"Brest region","Gomel region","Grodno region","Minsk city","Minsk region","Mogilev region","Vitebsk region",99.426577033444431,99.681712441762087,99.586991872496952,99.886273650945071,99.394256644801388,99.371054286420346,99.345560116791106]
["BLR",2012,"BLR_2012_MICS",19,"Water ladder","Limited","w_lim",0.27143455103091541,0.075754568709220899,0,0.024858685723376999,0,0.078984231625967405,0.025568420894835599,0.0342972861323768,0,0,0.27153964741266728,0.71314642040594733,0,0,0,"Brest region","Gomel region","Grodno region","Minsk city","Minsk region","Mogilev region","Vitebsk region",0.074861157929246594,0.24179201523662941,0,0,0,0.18600741278289351,0.0374351188405386]
["BLR",2012,"BLR_2012_MICS",20,"Water ladder","Unimproved","w_unimp",1.058889610152554,0.42250420984331882,0.1850918453529431,0.13548332745576969,0.10368418354875079,0.20396025134280571,0.31157591469349882,-5.21110932183e-15,0.18690172775403369,0.14319002513771301,1.894284321550187,1.3057285022611049,0.99179370966868419,0.052154845036795898,0.44949192096801482,"Brest region","Gomel region","Grodno region","Minsk city","Minsk region","Mogilev region","Vitebsk region",0.49856180862632221,0.076495543001283098,0.41300812750304772,0.1137263490549287,0.60574335519861222,0.44293830079676039,0.61700476436835583]
["BLR",2012,"BLR_2012_MICS",21,"Water ladder","Surface water","w_sur",0,0,0,0,0,0,0,0,0,0,0,0,0,0,0,"Brest region","Gomel region","Grodno region","Minsk city","Minsk region","Mogilev region","Vitebsk region",0,0,0,0,0,0,0]
["BLR",2012,"BLR_2012_MICS",22,"Improved water point at more than 30 minutes","Yes","",0.27433950353034231,0.076075992982250998,0,0.024892410789799001,0,0.079145657307538794,0.025648334928994199,0.0342972861323768,0,0,0.27678269867849759,0.72258137132334554,0,0,0,"Brest region","Gomel region","Grodno region","Minsk city","Minsk region","Mogilev region","Vitebsk region",0.0752362571737549,0.2419771169461763,0,0,0,0.18683497645288791,0.037667529290883198]
["BLR",2012,"BLR_2012_MICS",23,"Improved water point at more than 30 minutes","No","",99.725660496469658,99.92392400701776,100,99.975107589210197,100,99.920854342692465,99.974351665070998,99.965702713867628,100,100,99.723217301321512,99.277418628676656,100,100,100,"Brest region","Gomel region","Grodno region","Minsk city","Minsk region","Mogilev region","Vitebsk region",99.924763742826244,99.758022883053826,100,100,100,99.813165023547128,99.962332470709114]
["BLR",2012,"BLR_2012_MICS",29,"Piped water","Yes","w_pip",60.177162302121097,87.572136430473336,96.694280903837722,99.391798806169902,99.720843055663295,87.994528293570497,98.431789009178146,99.832314314391567,99.602317258220907,99.856809974862273,32.844611942913083,56.545491470324507,69.510866869379484,84.149282060727884,89.662829907575542,"Brest region","Gomel region","Grodno region","Minsk city","Minsk region","Mogilev region","Vitebsk region",78.512960277152359,85.956387695591388,85.75145482117874,99.886273650945085,85.392072070138724,93.654437833389949,90.269807232510686]
["BLR",2012,"BLR_2012_MICS",30,"Piped water","No","",39.822837697879173,12.42786356952657,3.3057190961623042,0.60820119383007842,0.27915694433669058,12.00547170642956,1.5682109908218811,0.1676856856084285,0.39768274177907359,0.14319002513771811,67.155388057086896,43.454508529675387,30.48913313062058,15.8507179392721,10.33717009242444,"Brest region","Gomel region","Grodno region","Minsk city","Minsk region","Mogilev region","Vitebsk region",21.487039722847719,14.04361230440853,14.248545178821381,0.1137263490549052,14.60792792986142,6.3455621666099926,9.7301927674893562]
["BLR",2012,"BLR_2012_MICS",31,"Piped water on premises","Yes","w_pop",47.451010517147353,84.823190196738452,96.53153467227294,99.253050107288587,99.720843055663295,78.524362293297571,97.827382671383177,99.640884088394031,99.602317258220907,99.856809974862273,18.166585642084879,47.200954105943786,65.717719067633112,82.120012726746822,89.26028175358735,"Brest region","Gomel region","Grodno region","Minsk city","Minsk region","Mogilev region","Vitebsk region",77.372678283962784,82.627515794089661,84.837475598056173,99.886273650945085,82.51420839660301,84.398375308579787,83.766287930921905]
["BLR",2012,"BLR_2012_MICS",32,"Piped water on premises","No","",52.548989482852953,15.176809803261509,3.4684653277270781,0.74694989271140766,0.27915694433669058,21.475637706702528,2.1726173286168509,0.35911591160597078,0.39768274177907359,0.14319002513771811,81.833414357915046,52.799045894056128,34.282280932366973,17.87998727325315,10.739718246412631,"Brest region","Gomel region","Grodno region","Minsk city","Minsk region","Mogilev region","Vitebsk region",22.627321716037329,17.372484205910261,15.16252440194395,0.1137263490549052,17.4857916033972,15.601624691420181,16.233712069078148]
["BLR",2012,"BLR_2012_MICS",35,"Water source on premises","Yes","",78.815234594969823,95.886841170098378,99.184371112051181,99.660293621130563,99.743587283397446,89.210094172749848,98.737667029816151,99.774272487870093,99.602317258220907,99.856809974862273,66.968925422902643,82.397124038933896,93.195979108804977,96.073286983081246,98.144621019520756,"Brest region","Gomel region","Grodno region","Minsk city","Minsk region","Mogilev region","Vitebsk region",97.998776348416939,91.892410033934652,97.69062644480023,99.886273650945085,94.195359833731757,87.344294375799009,91.128149985175085]
["BLR",2012,"BLR_2012_MICS",36,"Water source on premises","No","",21.18476540503034,4.1131588299015789,0.81562888794884014,0.33970637886942168,0.2564127166025551,10.789905827250159,1.262332970183867,0.22572751212991909,0.39768274177907359,0.14319002513771811,33.031074577097222,17.602875961066029,6.8040208911950337,3.9267130169187641,1.855378980479315,"Brest region","Gomel region","Grodno region","Minsk city","Minsk region","Mogilev region","Vitebsk region",2.001223651583127,8.1075899660652126,2.3093735551998309,0.1137263490549052,5.8046401662682863,12.655705624200991,8.8718500148249753]
["BLR",2012,"BLR_2012_MICS",37,"Improved Water source on premises","Yes","w_premises",79.200000000000003,96,99.400000000000006,99.799999999999997,99.799999999999997,89.299999999999997,99,99.799999999999997,99.799999999999997,100,67.299999999999997,83.200000000000003,93.200000000000003,96.099999999999994,98.599999999999994,"Brest region","Gomel region","Grodno region","Minsk city","Minsk region","Mogilev region","Vitebsk region",98.299999999999997,91.900000000000006,97.900000000000006,100,94.700000000000003,87.700000000000003,91.099999999999994]
["BLR",2012,"BLR_2012_MICS",38,"Improved Water source on premises","No","",20.800000000000001,4,0.59999999999999998,0.20000000000000001,0.20000000000000001,10.699999999999999,1,0.20000000000000001,0.20000000000000001,0,32.700000000000003,16.800000000000001,6.7999999999999998,3.8999999999999999,1.3999999999999999,"Brest region","Gomel region","Grodno region","Minsk city","Minsk region","Mogilev region","Vitebsk region",1.7,8.0999999999999996,2.1000000000000001,0,5.2999999999999998,12.300000000000001,8.9000000000000004]
["BLR",2012,"BLR_2012_MICS",41,"Water point at more than 30 minutes","Yes","",0.45259631741766448,0.099967305555872105,0.037113618453252901,0.024858685723376999,0,0.078984155334790696,0.1103140036741535,0.0342972861323768,0,0,0.27149199965837462,1.368564523689991,0,0,0,"Brest region","Gomel region","Grodno region","Minsk city","Minsk region","Mogilev region","Vitebsk region",0.15505897317077791,0.24179173199993151,0,0,0,0.49917924882087311,0.037434663320867298]
["BLR",2012,"BLR_2012_MICS",42,"Water point at more than 30 minutes","No","w_30min",99.547403682582342,99.900032694444135,99.962886381546738,99.975141314276613,100,99.92101584466522,99.889685996325852,99.965702713867628,100,100,99.728508000341634,98.631435476309989,100,100,100,"Brest region","Gomel region","Grodno region","Minsk city","Minsk region","Mogilev region","Vitebsk region",99.844941026829233,99.758208268000075,100,100,100,99.50082075117912,99.962565336679134]
["BLR",2012,"BLR_2012_MICS",58,"Main source of drinking water","Piped into dwelling","",45.328079231869069,82.060555619392034,94.604975957803902,95.747100439037851,94.244630812838025,75.884335723387267,95.17330404920213,96.487450507188981,96.264803719936182,93.548980587102577,16.24273227018335,44.988241119053377,63.020601579805863,80.423989116318026,88.037441916775265,"Brest region","Gomel region","Grodno region","Minsk city","Minsk region","Mogilev region","Vitebsk region",74.838649110533481,77.789008018942866,84.221431441842739,92.936701954913147,80.710772500858027,81.881493228123219,82.731408687359959]
["BLR",2012,"BLR_2012_MICS",59,"Main source of drinking water","Piped into compound, yard or plot","",2.0884698554874519,0.83390212332264158,0.022782186243957999,0.017026655081482898,0,1.449946829898614,0.031483963980138502,0,0,0,1.9238533719015229,2.2127129868904141,1.6477713145481829,1.0053750655498861,0.061817213058550098,"Brest region","Gomel region","Grodno region","Minsk city","Minsk region","Mogilev region","Vitebsk region",0.30539499999421171,0.60786612812617546,0.12058743892363991,0,0.63590872890939165,1.9903565016999269,0.8483582854184798]
["BLR",2012,"BLR_2012_MICS",60,"Main source of drinking water","Public tap / standpipe","",12.70418514259249,2.7489462337349342,0.16274623156477391,0.13874869888132921,0,9.4398719396084179,0.60440633779497022,0.19143022599754231,0,0,14.678026300828179,9.3445373643807432,3.793147801746394,2.0292693339810541,0.40254815398818172,"Brest region","Gomel region","Grodno region","Minsk city","Minsk region","Mogilev region","Vitebsk region",1.1402819931895929,3.3288719015017159,0.91397922312257274,0,2.8493751036064858,9.25606252481019,6.5035193015888089]
["BLR",2012,"BLR_2012_MICS",61,"Main source of drinking water","Tube well, Borehole","",5.5276348209022368,3.9952027891941522,1.0989340469639901,0.47271786637431668,0.022744227734135501,2.6379216110515191,0.21525531453052801,0.1676856856084285,0,0,5.2409571543263507,6.7757617975196718,9.7492675367881994,5.9923309555695212,4.6387139660870691,"Brest region","Gomel region","Grodno region","Minsk city","Minsk region","Mogilev region","Vitebsk region",7.5377275315547152,3.1780260000154921,0.040872944406855197,0,1.450517567703054,2.5815844297956021,0.49228059611723213]
["BLR",2012,"BLR_2012_MICS",62,"Main source of drinking water","Protected well","",33.236313266824332,8.010156570489114,1.8822558665451681,0,0.15272853305379591,9.1635898440352328,1.0413797615978699,0,0.21078101402504229,0,60.020146581210362,35.37301822989464,19.7480718841637,9.8062321386657665,4.7425691369806806,"Brest region","Gomel region","Grodno region","Minsk city","Minsk region","Mogilev region","Vitebsk region",13.45075038266666,10.78909076139179,13.54411649572727,0,12.551667006959731,3.321039436017641,8.6209074070037666]
["BLR",2012,"BLR_2012_MICS",63,"Main source of drinking water","Unprotected well","",0.70271848572863649,0.069090781900841294,0,0,0,0.075456709068728603,0,0,0,0,1.595302507247234,0.65031039897704801,0.30529874626256959,0.052154845036810303,0,"Brest region","Gomel region","Grodno region","Minsk city","Minsk region","Mogilev region","Vitebsk region",0.15360202252250349,0.0342403553684099,0.41300812750304322,0,0.230197002497596,0,0.33252084091762502]
["BLR",2012,"BLR_2012_MICS",64,"Main source of drinking water","Bottled water","",0.0564280721720909,1.928732454023754,2.0432138655253071,3.488923013169289,5.4762122428252891,1.220373800676172,2.6225946582008892,3.1534335812050109,3.337513538284719,6.3078293877596874,0,0,1.0493461732790701,0.69064854487890892,1.6674176921421879,"Brest region","Gomel region","Grodno region","Minsk city","Minsk region","Mogilev region","Vitebsk region",2.2286341734351209,4.230641647020585,0.74600432847399256,6.9495716960320708,1.196015736764837,0.52652557875664097,0.1865209581434758]
["BLR",2012,"BLR_2012_MICS",65,"Main source of drinking water","Other","",0.35617112442394683,0.35341342794246539,0.18509184535297249,0.13548332745576169,0.10368418354875911,0.12850354227407421,0.31157591469348211,0,0.18690172775403141,0.14319002513771811,0.29898181430289961,0.65541810328404315,0.68649496340610394,0,0.44949192096803148,"Brest region","Gomel region","Grodno region","Minsk city","Minsk region","Mogilev region","Vitebsk region",0.344959786103816,0.042255187632852499,0,0.1137263490549052,0.37554635270103959,0.44293830079675062,0.28448392345072843]
["BLR",2012,"BLR_2012_MICS",122,"Sanitation","Improved","s_imp",94.409774493805244,98.097487477745673,99.599450231672577,100,100,97.544268834531209,99.352595620765868,100,100,100,91.710819367666844,94.309864420185562,95.838389953326541,97.871155706408132,99.785164358837847,"Brest region","Gomel region","Grodno region","Minsk city","Minsk region","Mogilev region","Vitebsk region",99.774718968217257,94.704251331452895,99.805178332135242,100,96.797567762501842,99.974518161194268,98.287426810417614,3851.6465420814779,4001.7524847354362,4063.5939631558131,4078.7121987191531,4080.4391812656609,2885.6085249924608,2933.1790469338112,2956.2521160631832,2956.6206105066749,2954.654171077822,1030.3343342988719,1060.5395109453559,1077.798443037306,1100.1489832408381,1121.008628861222,3112.6794805714139,2910.4681105711479,2266.1844476287538,3720.1317772510461,3044.9975059449612,2354.359896907059,2667.3231510831611]
["BLR",2012,"BLR_2012_MICS",123,"Sanitation","Not Improved","",5.5902255061948054,1.902512522254334,0.40054976832745343,0,0,2.4557311654687921,0.64740437923413707,0,0,0,8.2891806323330659,5.6901355798143971,4.1616100466734984,2.1288442935918952,0.21483564116216439,"Brest region","Gomel region","Grodno region","Minsk city","Minsk region","Mogilev region","Vitebsk region",0.2252810317827417,5.2957486685470716,0.19482166786475619,0,3.2024322374981802,0.025481838805739201,1.712573189582401,228.06507965765459,77.610389510727558,16.342174748282901,0,0,72.646797918873062,19.11326974597791,0,0,0,93.125625390596326,63.987088117767613,46.801462660396233,23.929888925587068,2.4135111574668571,7.0281094473988892,162.74990198129481,4.4236365402500413,0,100.74011570275501,0.60008710706614188,46.475793137900162]
["BLR",2012,"BLR_2012_MICS",124,"Sanitation ladder","Basic","s_bas",90.897229613136531,94.678493158590285,96.005037073079436,97.908392398127319,99.061608512875495,92.254890241527704,94.894534453225077,96.983447678956267,98.351529948603044,99.115036721985405,89.011527567835088,92.307809438648917,93.822619283606841,96.039262294542738,99.360249417560894,"Brest region","Gomel region","Grodno region","Minsk city","Minsk region","Mogilev region","Vitebsk region",97.750852341209196,93.41724469742681,98.983041724487563,96.375047532654705,94.763206038989395,92.918823463771773,95.831107107883795,3708.344840366035,3862.279299807225,3916.9442017527922,3993.4015443122348,4042.1486873513718,2729.1352012160019,2801.5640496116189,2867.075224240175,2907.8816052090428,2928.5065666714572,1000.008871732581,1038.0258701501079,1055.129087986556,1079.5570564374509,1116.2350403346691,3049.540759796786,2870.9155908715129,2247.516947352593,3585.278768603087,2981.0018238480288,2188.2011101885528,2600.6635729291038]
["BLR",2012,"BLR_2012_MICS",125,"Sanitation ladder","Limited","s_lim",3.5125448806687189,3.4189943191554479,3.5944131585931278,2.0916076018726688,0.93839148712448539,5.2893785930034927,4.4580611675407997,3.016552321043716,1.648470051396961,0.88496327801458952,2.6992917998317458,2.0020549815366371,2.0157706697197,1.8318934118654111,0.42491494127695162,"Brest region","Gomel region","Grodno region","Minsk city","Minsk region","Mogilev region","Vitebsk region",2.023866627008077,1.2870066340260879,0.82213660764769214,3.6249524673454352,2.0343617235124771,7.055694697422485,2.4563197025338712,143.30170171544461,139.4731849282127,146.64976140302099,85.310654406917678,38.290493914289009,156.47332377645839,131.61499732219229,89.176891823007907,48.739005297632538,26.14760440636509,30.325462566290881,22.513640795247799,22.669355050749669,20.591926803387761,4.7735885265526834,63.138720774628737,39.552519699634637,18.667500276161309,134.85300864796329,63.995682096932867,166.15878671850609,66.659578154058082]
["BLR",2012,"BLR_2012_MICS",126,"Sanitation ladder","Unimproved","s_unimp",5.5902255061947486,1.902512522254266,0.40054976832743661,1.24344978758e-14,1.9984014443300001e-14,2.4557311654688032,0.64740437923412308,1.68753899743e-14,-5.7731597280499999e-15,5.7731597280499999e-15,8.2891806323331654,5.690135579814446,4.1616100466734594,2.1288442935918508,0.21483564116215451,"Brest region","Gomel region","Grodno region","Minsk city","Minsk region","Mogilev region","Vitebsk region",0.22528103178272649,5.2957486685471018,0.1948216678647445,-1.3944401189300001e-13,3.2024322374981282,0.025481838805742299,1.712573189582334,228.06507965765459,77.610389510727558,16.342174748282901,0,0,72.646797918873062,19.11326974597791,0,0,0,93.125625390596326,63.987088117767613,46.801462660396233,23.929888925587068,2.4135111574668571,7.0281094473988892,162.74990198129481,4.4236365402500413,0,100.74011570275501,0.60008710706614188,46.475793137900162]
["BLR",2012,"BLR_2012_MICS",127,"Sanitation ladder","Open defecation","s_od",0,0,0,0,0,0,0,0,0,0,0,0,0,0,0,"Brest region","Gomel region","Grodno region","Minsk city","Minsk region","Mogilev region","Vitebsk region",0,0,0,0,0,0,0,716.20520008728272,2112.3233258430678,3645.869742773506,4017.5742080944451,4070.914674843978,1215.3812724469069,2676.5140698404489,2924.1248013534018,2955.84638213375,2954.654171077822,55.887117907849053,179.00413016281161,307.82809686591338,485.92489887538608,807.72221097798786,1988.8710922845919,1868.5136258024691,1792.8366991626101,3708.9545483517609,1902.364748848752,1364.7436943424941,1936.6027428496029]
["BLR",2012,"BLR_2012_MICS",128,"Shared among Improved Sanitation","Yes","s_shared",3.7205309508489481,3.4853026382873251,3.6088684729005731,2.0916076018726688,0.93839148712448528,5.4225416379675844,4.4871109201388721,3.016552321043716,1.648470051396961,0.88496327801458952,2.9432642936165898,2.1228479055136131,2.1033018925937541,1.8717398386105579,0.42582977540520273,"Brest region","Gomel region","Grodno region","Minsk city","Minsk region","Mogilev region","Vitebsk region",2.028436309254622,1.3589745084639631,0.82374143444917913,3.6249524673454352,2.1016661580835332,7.0574930764319479,2.4991189435366539]
["BLR",2012,"BLR_2012_MICS",129,"Shared among Improved Sanitation","No","",96.279469049151061,96.514697361712734,96.391131527099418,97.908392398127319,99.061608512875509,94.577458362032402,95.512889079861139,96.983447678956267,98.351529948603044,99.11503672198539,97.056735706383407,97.877152094486377,97.896698107406237,98.128260161389449,99.574170224594809,"Brest region","Gomel region","Grodno region","Minsk city","Minsk region","Mogilev region","Vitebsk region",97.971563690745384,98.641025491536041,99.176258565550825,96.37504753265469,97.898333841916497,92.942506923568047,97.500881056463399]
["BLR",2012,"BLR_2012_MICS",135,"Sanitation type","Sewer connection","s_sew",17.555289846245881,51.780716522636141,89.360951238967843,98.501046711657963,99.766581340915153,41.084394001894452,90.658843459326363,98.913241717943706,99.973813739572321,100,4.9745536034320779,15.91817661867182,27.3722321428559,43.228719167976912,71.898370363659666,"Brest region","Gomel region","Grodno region","Minsk city","Minsk region","Mogilev region","Vitebsk region",63.751843238378562,60.799904795904339,78.95843900418204,99.699547500773107,60.474361744521701,57.951884686220133,71.361319782864925]
["BLR",2012,"BLR_2012_MICS",136,"Sanitation type","Septic tank connection","s_sep",7.3683794112313237,14.21983693173555,3.9815086635002781,0.91115157738944175,0.23341865908486351,8.6832741180906829,3.8565828064563958,0.79850546915039722,0.026186260427669899,0,0.91831719117177124,11.350826609768889,16.615740694720689,21.36269998346706,11.549788043512249,"Brest region","Gomel region","Grodno region","Minsk city","Minsk region","Mogilev region","Vitebsk region",9.9207183933570366,3.6143836260595368,0.29386006652196561,0.1228011425022401,11.35679840276801,8.273065047436102,3.903002038630333]
["BLR",2012,"BLR_2012_MICS",137,"Sanitation type","Improved latrines","s_lat",69.486105236328228,32.096934023373947,6.2569903292045126,0.58780171095260147,0,47.776600714546142,4.8371693549832244,0.28825281290590798,0,0,85.817948573062978,67.040861191744824,51.850417115749948,33.279736554964018,16.33700595166588,"Brest region","Gomel region","Grodno region","Minsk city","Minsk region","Mogilev region","Vitebsk region",26.10215733648192,30.289962909488889,20.552879261431318,0.17765135672465401,24.966407615212258,33.749568427538037,23.023104988922359]
["BLR",2012,"BLR_2012_MICS",138,"Sanitation type","Unimproved facilities","",5.5902255061948054,1.902512522254334,0.40054976832745343,0,0,2.4557311654687921,0.64740437923413707,0,0,0,8.2891806323330659,5.6901355798143971,4.1616100466734984,2.1288442935918952,0.21483564116216439,"Brest region","Gomel region","Grodno region","Minsk city","Minsk region","Mogilev region","Vitebsk region",0.2252810317827417,5.2957486685470716,0.19482166786475619,0,3.2024322374981802,0.025481838805739201,1.712573189582401]
["BLR",2012,"BLR_2012_MICS",139,"Sanitation type","Open defecation","",0,0,0,0,0,0,0,0,0,0,0,0,0,0,0,"Brest region","Gomel region","Grodno region","Minsk city","Minsk region","Mogilev region","Vitebsk region",0,0,0,0,0,0,0]
["BLR",2012,"BLR_2012_MICS",148,"Shared among improved sanitation facilities","Yes","",3.5125448806687189,3.4189943191554479,3.5944131585931278,2.0916076018726688,0.93839148712448528,5.2893785930034927,4.4580611675407997,3.016552321043716,1.648470051396961,0.88496327801458952,2.6992917998317458,2.0020549815366371,2.0157706697196991,1.8318934118654111,0.42491494127695162,"Brest region","Gomel region","Grodno region","Minsk city","Minsk region","Mogilev region","Vitebsk region",2.023866627008077,1.2870066340260879,0.82213660764769225,3.6249524673454352,2.0343617235124771,7.0556946974224859,2.4563197025338699]
["BLR",2012,"BLR_2012_MICS",149,"Shared among improved sanitation facilities","No","",90.897229613136545,94.678493158590271,96.00503707307945,97.908392398127319,99.061608512875509,92.254890241527704,94.894534453225106,96.983447678956267,98.351529948603044,99.11503672198539,89.011527567835074,92.307809438648917,93.822619283606826,96.039262294542738,99.360249417560894,"Brest region","Gomel region","Grodno region","Minsk city","Minsk region","Mogilev region","Vitebsk region",97.750852341209196,93.41724469742681,98.983041724487563,96.37504753265469,94.763206038989395,92.918823463771773,95.831107107883781]
["BLR",2012,"BLR_2012_MICS",150,"Shared among improved sanitation facilities","DK/missing","",5.5902255061948054,1.902512522254334,0.40054976832745343,0,0,2.4557311654687921,0.64740437923413707,0,0,0,8.2891806323330659,5.6901355798143971,4.1616100466734984,2.1288442935918952,0.21483564116216439,"Brest region","Gomel region","Grodno region","Minsk city","Minsk region","Mogilev region","Vitebsk region",0.2252810317827417,5.2957486685470716,0.19482166786475619,0,3.2024322374981802,0.025481838805739201,1.712573189582401]
["BLR",2012,"BLR_2012_MICS",151,"Shared among all sanitation facilities","Yes","",4.2536534258142504,3.6709533938926402,3.5944131585931278,2.0916076018726688,0.93839148712448528,6.0674865941969216,4.4890286949576277,3.016552321043716,1.648470051396961,0.88496327801458952,2.8100264292614132,2.9576805905862722,2.2754076751175618,1.980507734432968,0.42491494127695162,"Brest region","Gomel region","Grodno region","Minsk city","Minsk region","Mogilev region","Vitebsk region",2.023866627008077,1.563112937671546,0.82213660764769225,3.6249524673454352,2.7859618737440561,7.0556946974224859,2.765285076308579]
["BLR",2012,"BLR_2012_MICS",152,"Shared among all sanitation facilities","No","",95.746346574185765,96.329046606107397,96.405586841406887,97.908392398127319,99.061608512875509,93.932513405803093,95.510971305042403,96.983447678956267,98.351529948603044,99.11503672198539,97.189973570738573,97.042319409413707,97.724592324882451,98.019492265567038,99.575085058723062,"Brest region","Gomel region","Grodno region","Minsk city","Minsk region","Mogilev region","Vitebsk region",97.976133372991939,98.436887062328438,99.177863392352307,96.37504753265469,97.214038126255943,92.944305302577519,97.23471492369147]
["BLR",2012,"BLR_2012_MICS",153,"Type of toilet facility","Flush to piped sewer system","",17.555289846245881,51.780716522636141,89.360951238967843,98.501046711657963,99.766581340915153,41.084394001894452,90.658843459326363,98.913241717943706,99.973813739572321,100,4.9745536034320779,15.91817661867182,27.3722321428559,43.228719167976912,71.898370363659666,"Brest region","Gomel region","Grodno region","Minsk city","Minsk region","Mogilev region","Vitebsk region",63.751843238378562,60.799904795904339,78.95843900418204,99.699547500773107,60.474361744521701,57.951884686220133,71.361319782864925,716.20520008728272,2112.3233258430678,3645.869742773506,4017.5742080944451,4070.914674843978,1215.3812724469069,2676.5140698404489,2924.1248013534018,2955.84638213375,2954.654171077822,55.887117907849053,179.00413016281161,307.82809686591338,485.92489887538608,807.72221097798786,1988.8710922845919,1868.5136258024691,1792.8366991626101,3708.9545483517609,1902.364748848752,1364.7436943424941,1936.6027428496029]
["BLR",2012,"BLR_2012_MICS",154,"Type of toilet facility","Flush to septic tank","",7.3683794112313237,14.21983693173555,3.9815086635002781,0.91115157738944175,0.23341865908486351,8.6832741180906829,3.8565828064563958,0.79850546915039722,0.026186260427669899,0,0.91831719117177124,11.350826609768889,16.615740694720689,21.36269998346706,11.549788043512249,"Brest region","Gomel region","Grodno region","Minsk city","Minsk region","Mogilev region","Vitebsk region",9.9207183933570366,3.6143836260595368,0.29386006652196561,0.1228011425022401,11.35679840276801,8.273065047436102,3.903002038630333,300.60863117383769,580.0787485715648,162.44301079593021,37.163250535805147,9.5245064216836859,256.87341880139979,113.85759788140599,23.605834828638859,0.77422837292544222,0,10.31692594575985,127.6430644403862,186.8606041838035,240.13359703845359,129.75287600604801,309.49740470195201,111.07788863880791,6.6724104265921644,4.5683643250531736,357.25507997056019,194.8273713185794,105.9196281172765]
["BLR",2012,"BLR_2012_MICS",155,"Type of toilet facility","Flush to pit (latrine)","",4.8961250452482359,7.3495347761581566,3.3602592916853249,0.58780171095260147,0,7.9150989245968164,2.311013585361223,0.25326406531307238,0,0,2.634702652847646,5.0253559597829058,6.3782129618409424,8.4376838063068469,8.7306825752677408,"Brest region","Gomel region","Grodno region","Minsk city","Minsk region","Mogilev region","Vitebsk region",1.610216233735722,10.022128220198841,1.901096798345977,0.14984708383780659,4.6874057806936129,3.5173374353123319,0.86118827323962754,199.74778248587259,299.81419308840668,137.09643316874971,23.974740088903651,0,234.14883525058301,68.227876518045491,7.4871242900453456,0,0,29.59982936161953,56.511464465362728,71.72937695406182,94.846220966903104,98.082421025311589,50.234038059568412,308.00184970425238,43.166457591121869,5.5745089831342574,147.45348712256879,82.831889104354147,23.370918266932598]
["BLR",2012,"BLR_2012_MICS",156,"Type of toilet facility","Ventilated Improved Pit latrine (VIP)","",7.2629254594174988,4.5058532999220642,0.60256664116005332,0,0,4.4767743117770706,0.64403330620269061,0,0,0,10.896720712566919,6.319058099344506,8.4028040860335178,4.0687164072425057,1.7392752378683181,"Brest region","Gomel region","Grodno region","Minsk city","Minsk region","Mogilev region","Vitebsk region",9.8304490117881418,2.1539264122172348,0.050880928736928802,0,3.3325520226277932,0.7433949693613181,0.30692889743420643,296.30641404610589,183.81010668501631,24.584334147643901,0,0,132.4344143728724,19.013745815880849,0,0,0,122.4202941248783,71.059489137381647,94.497926827495576,45.735581502181851,19.53940309807539,306.68126395368409,66.194854477384681,1.1553064812009759,0,104.8333427367844,17.50665405163311,8.3294331780788369]
["BLR",2012,"BLR_2012_MICS",157,"Type of toilet facility","Pit latrine with slab","",57.327054731662493,20.24154594729373,2.2941643963591329,0,0,35.384727478172273,1.882122463419313,0.034988747592835601,0,0,72.28652520764841,55.696447132617408,37.069400067875513,20.773336341414652,5.8670481385298183,"Brest region","Gomel region","Grodno region","Minsk city","Minsk region","Mogilev region","Vitebsk region",14.66149209095801,18.113908277072809,18.600901534348431,0.0278042728868475,16.946449811890851,29.48883602286438,21.854987818248521,2338.7785142883872,825.72611054737922,93.600442269985606,0,0,1046.770584120701,55.56575687803273,1.0343555910972091,0,0,812.11016695876469,626.32136273941342,416.88243820603179,233.5086848579119,65.911717753798314,457.39568157162489,556.67989194822951,422.35357396723168,1.0343555910972091,533.09084726629874,694.45028808999859,593.10042867126992]
["BLR",2012,"BLR_2012_MICS",158,"Type of toilet facility","Pit latrine without slab / Open pit","",4.849665146517852,1.68032165582091,0.32900605743508832,0,0,2.117250532681989,0.54853416578664427,0,0,0,7.6843921453330939,4.3140578191410173,3.539641249745233,2.1288442935918952,0.21483564116216439,"Brest region","Gomel region","Grodno region","Minsk city","Minsk region","Mogilev region","Vitebsk region",0.2252810317827417,5.2007688232131928,0.19482166786475619,0,3.2024322374981802,0.025481838805739201,0.26527736618977271,197.85235259792091,68.5464177954766,13.42323703318767,0,0,62.633676582433509,16.19433203088267,0,0,0,86.331068898339907,48.512727675203259,39.806802156671843,23.929888925587068,2.4135111574668571,7.0281094473988892,159.8309642661996,4.4236365402500413,0,100.74011570275501,0.60008710706614188,7.1990943629154902]
["BLR",2012,"BLR_2012_MICS",159,"Type of toilet facility","Other","",0.74056035967695155,0.22219086643342359,0.071543710892365206,0,0,0.33848063278680202,0.098870213447492694,0,0,0,0.60478848699997045,1.3760777606733781,0.62196879692826379,0,0,"Brest region","Gomel region","Grodno region","Minsk city","Minsk region","Mogilev region","Vitebsk region",0,0.094979845333879404,0,0,0,0,1.447295823392629,30.212727059733702,9.0639717152509629,2.9189377150952338,0,0,10.01312133643953,2.9189377150952338,0,0,0,6.7945564922564179,15.474360442564331,6.9946605037243854,0,0,0,2.9189377150952338,0,0,0,0,39.276698774984673]